Search Unity

  1. Unity 6 Preview is now available. To find out what's new, have a look at our Unity 6 Preview blog post.
    Dismiss Notice
  2. Unity is excited to announce that we will be collaborating with TheXPlace for a summer game jam from June 13 - June 19. Learn more.
    Dismiss Notice

Build failure with Android Target API 31

Discussion in 'Android' started by gtalwadkar, Jun 3, 2022.

  1. gtalwadkar

    gtalwadkar

    Joined:
    Jun 19, 2019
    Posts:
    10
    I'm updating Android Target API to 31 to meet Google's app submission requirement. But getting build failure.
    It works fine with Target API 30.
    Unity Version: 2019.4.31f1
    Gradle: 5.1.1
    AGP: 3.4.3


    18:24:45 Mapping new ns http://schemas.android.com/repository/android/common/02 to old ns http://schemas.android.com/repository/android/common/01
    18:24:45 Mapping new ns http://schemas.android.com/repository/android/generic/02 to old ns http://schemas.android.com/repository/android/generic/01
    18:24:45 Mapping new ns http://schemas.android.com/sdk/android/repo/addon2/02 to old ns http://schemas.android.com/sdk/android/repo/addon2/01
    18:24:45 Mapping new ns http://schemas.android.com/sdk/android/repo/addon2/03 to old ns http://schemas.android.com/sdk/android/repo/addon2/01
    18:24:45 Mapping new ns http://schemas.android.com/sdk/android/repo/repository2/02 to old ns http://schemas.android.com/sdk/android/repo/repository2/01
    18:24:45 Mapping new ns http://schemas.android.com/sdk/android/repo/repository2/03 to old ns http://schemas.android.com/sdk/android/repo/repository2/01
    18:24:45 Mapping new ns http://schemas.android.com/sdk/android/repo/sys-img2/03 to old ns http://schemas.android.com/sdk/android/repo/sys-img2/01
    18:24:45 Mapping new ns http://schemas.android.com/sdk/android/repo/sys-img2/02 to old ns http://schemas.android.com/sdk/android/repo/sys-img2/01
    18:24:45 Mapping new ns http://schemas.android.com/repository/android/common/02 to old ns http://schemas.android.com/repository/android/common/01
    18:24:45 Mapping new ns http://schemas.android.com/repository/android/generic/02 to old ns http://schemas.android.com/repository/android/generic/01
    18:24:45 Mapping new ns http://schemas.android.com/sdk/android/repo/addon2/02 to old ns http://schemas.android.com/sdk/android/repo/addon2/01
    18:24:45 Mapping new ns http://schemas.android.com/sdk/android/repo/addon2/03 to old ns http://schemas.android.com/sdk/android/repo/addon2/01
    18:24:45 Mapping new ns http://schemas.android.com/sdk/android/repo/repository2/02 to old ns http://schemas.android.com/sdk/android/repo/repository2/01
    18:24:45 Mapping new ns http://schemas.android.com/sdk/android/repo/repository2/03 to old ns http://schemas.android.com/sdk/android/repo/repository2/01
    18:24:45 Mapping new ns http://schemas.android.com/sdk/android/repo/sys-img2/03 to old ns http://schemas.android.com/sdk/android/repo/sys-img2/01
    18:24:45 Mapping new ns http://schemas.android.com/sdk/android/repo/sys-img2/02 to old ns http://schemas.android.com/sdk/android/repo/sys-img2/01
    18:24:45 cvc-complex-type.2.4.a: Invalid content was found starting with element 'base-extension'. One of '{layoutlib}' is expected.:
    18:24:45 org.xml.sax.SAXParseException; lineNumber: 141; columnNumber: 252; cvc-complex-type.2.4.a: Invalid content was found starting with element 'base-extension'. One of '{layoutlib}' is expected.
    18:24:45 at com.sun.org.apache.xerces.internal.util.ErrorHandlerWrapper.createSAXParseException(ErrorHandlerWrapper.java:203)
    18:24:45 at com.sun.org.apache.xerces.internal.util.ErrorHandlerWrapper.error(ErrorHandlerWrapper.java:134)
    18:24:45 at com.sun.org.apache.xerces.internal.impl.XMLErrorReporter.reportError(XMLErrorReporter.java:396)
    18:24:45 at com.sun.org.apache.xerces.internal.impl.XMLErrorReporter.reportError(XMLErrorReporter.java:327)
    18:24:45 at com.sun.org.apache.xerces.internal.impl.XMLErrorReporter.reportError(XMLErrorReporter.java:284)
    18:24:45 at com.sun.org.apache.xerces.internal.impl.xs.XMLSchemaValidator$XSIErrorReporter.reportError(XMLSchemaValidator.java:453)
    18:24:45 at com.sun.org.apache.xerces.internal.impl.xs.XMLSchemaValidator.reportSchemaError(XMLSchemaValidator.java:3231)
    18:24:45 at com.sun.org.apache.xerces.internal.impl.xs.XMLSchemaValidator.handleStartElement(XMLSchemaValidator.java:1791)
    18:24:45 at com.sun.org.apache.xerces.internal.impl.xs.XMLSchemaValidator.startElement(XMLSchemaValidator.java:741)
    18:24:45 at com.sun.org.apache.xerces.internal.jaxp.validation.ValidatorHandlerImpl.startElement(ValidatorHandlerImpl.java:568)
    18:24:45 at com.sun.xml.bind.v2.runtime.unmarshaller.ValidatingUnmarshaller.startElement(ValidatingUnmarshaller.java:101)
    18:24:45 at com.sun.xml.bind.v2.runtime.unmarshaller.SAXConnector.startElement(SAXConnector.java:168)
    18:24:45 at org.xml.sax.helpers.XMLFilterImpl.startElement(XMLFilterImpl.java:551)
    18:24:45 at com.android.repository.impl.meta.SchemaModuleUtil$NamespaceFallbackFilter.startElement(SchemaModuleUtil.java:400)
    18:24:45 at com.sun.org.apache.xerces.internal.parsers.AbstractSAXParser.startElement(AbstractSAXParser.java:509)
    18:24:45 at com.sun.org.apache.xerces.internal.impl.XMLNSDocumentScannerImpl.scanStartElement(XMLNSDocumentScannerImpl.java:374)
    18:24:45 at com.sun.org.apache.xerces.internal.impl.XMLDocumentFragmentScannerImpl$FragmentContentDriver.next(XMLDocumentFragmentScannerImpl.java:2784)
    18:24:45 at com.sun.org.apache.xerces.internal.impl.XMLDocumentScannerImpl.next(XMLDocumentScannerImpl.java:602)
    18:24:45 at com.sun.org.apache.xerces.internal.impl.XMLNSDocumentScannerImpl.next(XMLNSDocumentScannerImpl.java:112)
    18:24:45 at com.sun.org.apache.xerces.internal.impl.XMLDocumentFragmentScannerImpl.scanDocument(XMLDocumentFragmentScannerImpl.java:505)
    18:24:45 at com.sun.org.apache.xerces.internal.parsers.XML11Configuration.parse(XML11Configuration.java:842)
    18:24:45 at com.sun.org.apache.xerces.internal.parsers.XML11Configuration.parse(XML11Configuration.java:771)
    18:24:45 at com.sun.org.apache.xerces.internal.parsers.XMLParser.parse(XMLParser.java:141)
    18:24:45 at com.sun.org.apache.xerces.internal.parsers.AbstractSAXParser.parse(AbstractSAXParser.java:1213)
    18:24:45 at com.sun.org.apache.xerces.internal.jaxp.SAXParserImpl$JAXPSAXParser.parse(SAXParserImpl.java:643)
    18:24:45 at org.xml.sax.helpers.XMLFilterImpl.parse(XMLFilterImpl.java:357)
    18:24:45 at com.sun.xml.bind.v2.runtime.unmarshaller.UnmarshallerImpl.unmarshal0(UnmarshallerImpl.java:258)
    18:24:45 at com.sun.xml.bind.v2.runtime.unmarshaller.UnmarshallerImpl.unmarshal(UnmarshallerImpl.java:229)
    18:24:45 at javax.xml.bind.helpers.AbstractUnmarshallerImpl.unmarshal(AbstractUnmarshallerImpl.java:140)
    18:24:45 at javax.xml.bind.helpers.AbstractUnmarshallerImpl.unmarshal(AbstractUnmarshallerImpl.java:123)
    18:24:45 at com.android.repository.impl.meta.SchemaModuleUtil.unmarshal(SchemaModuleUtil.java:193)
    18:24:45 at com.android.repository.impl.manager.LocalRepoLoaderImpl.parsePackage(LocalRepoLoaderImpl.java:305)
    18:24:45 at com.android.repository.impl.manager.LocalRepoLoaderImpl.parsePackages(LocalRepoLoaderImpl.java:159)
    18:24:45 at com.android.repository.impl.manager.LocalRepoLoaderImpl.getPackages(LocalRepoLoaderImpl.java:124)
    18:24:45 at com.android.repository.impl.manager.RepoManagerImpl$LoadTask.run(RepoManagerImpl.java:520)
    18:24:45 at com.android.repository.api.RepoManager$DummyProgressRunner.runSyncWithProgress(RepoManager.java:397)
    18:24:45 at com.android.repository.impl.manager.RepoManagerImpl.load(RepoManagerImpl.java:365)
    18:24:45 at com.android.repository.api.RepoManager.loadSynchronously(RepoManager.java:290)
    18:24:45 at com.android.sdklib.repository.AndroidSdkHandler$RepoConfig.createRepoManager(AndroidSdkHandler.java:731)
    18:24:45 at com.android.sdklib.repository.AndroidSdkHandler.getSdkManager(AndroidSdkHandler.java:297)
    18:24:45 at com.android.builder.sdk.DefaultSdkLoader.init(DefaultSdkLoader.java:386)
    18:24:45 at com.android.builder.sdk.DefaultSdkLoader.getSdkInfo(DefaultSdkLoader.java:367)
    18:24:45 at com.android.build.gradle.internal.SdkHandler.initTarget(SdkHandler.java:179)
    18:24:45 at com.android.build.gradle.BasePlugin.ensureTargetSetup(BasePlugin.java:867)
    18:24:45 at com.android.build.gradle.BasePlugin.createAndroidTasks(BasePlugin.java:717)
    18:24:45 at com.android.builder.profile.ThreadRecorder.record(ThreadRecorder.java:81)
    18:24:45 at com.android.build.gradle.BasePlugin.lambda$createTasks$4(BasePlugin.java:646)
    18:24:45 at com.android.build.gradle.internal.crash.CrashReporting$afterEvaluate$1.execute(crash_reporting.kt:37)
    18:24:45 at com.android.build.gradle.internal.crash.CrashReporting$afterEvaluate$1.execute(crash_reporting.kt)
    18:24:45 at org.gradle.configuration.internal.DefaultListenerBuildOperationDecorator$BuildOperationEmittingAction$1$1.run(DefaultListenerBuildOperationDecorator.java:150)
    18:24:45 at org.gradle.configuration.internal.DefaultUserCodeApplicationContext.reapply(DefaultUserCodeApplicationContext.java:58)
    18:24:45 at org.gradle.configuration.internal.DefaultListenerBuildOperationDecorator$BuildOperationEmittingAction$1.run(DefaultListenerBuildOperationDecorator.java:147)
    18:24:45 at org.gradle.internal.operations.DefaultBuildOperationExecutor$RunnableBuildOperationWorker.execute(DefaultBuildOperationExecutor.java:301)
    18:24:45 at org.gradle.internal.operations.DefaultBuildOperationExecutor$RunnableBuildOperationWorker.execute(DefaultBuildOperationExecutor.java:293)
    18:24:45 at org.gradle.internal.operations.DefaultBuildOperationExecutor.execute(DefaultBuildOperationExecutor.java:175)
    18:24:45 at org.gradle.internal.operations.DefaultBuildOperationExecutor.run(DefaultBuildOperationExecutor.java:91)
    18:24:45 at org.gradle.configuration.internal.DefaultListenerBuildOperationDecorator$BuildOperationEmittingAction.execute(DefaultListenerBuildOperationDecorator.java:144)
    18:24:45 at org.gradle.internal.event.BroadcastDispatch$ActionInvocationHandler.dispatch(BroadcastDispatch.java:91)
    18:24:45 at org.gradle.internal.event.BroadcastDispatch$ActionInvocationHandler.dispatch(BroadcastDispatch.java:80)
    18:24:45 at org.gradle.internal.event.AbstractBroadcastDispatch.dispatch(AbstractBroadcastDispatch.java:42)
    18:24:45 at org.gradle.internal.event.BroadcastDispatch$SingletonDispatch.dispatch(BroadcastDispatch.java:230)
    18:24:45 at org.gradle.internal.event.BroadcastDispatch$SingletonDispatch.dispatch(BroadcastDispatch.java:149)
    18:24:45 at org.gradle.internal.event.AbstractBroadcastDispatch.dispatch(AbstractBroadcastDispatch.java:58)
    18:24:45 at org.gradle.internal.event.BroadcastDispatch$CompositeDispatch.dispatch(BroadcastDispatch.java:324)
    18:24:45 at org.gradle.internal.event.BroadcastDispatch$CompositeDispatch.dispatch(BroadcastDispatch.java:234)
    18:24:45 at org.gradle.internal.event.ListenerBroadcast.dispatch(ListenerBroadcast.java:140)
    18:24:45 at org.gradle.internal.event.ListenerBroadcast.dispatch(ListenerBroadcast.java:37)
    18:24:45 at org.gradle.internal.dispatch.ProxyDispatchAdapter$DispatchingInvocationHandler.invoke(ProxyDispatchAdapter.java:93)
    18:24:45 at com.sun.proxy.$Proxy26.afterEvaluate(Unknown Source)
    18:24:45 at org.gradle.configuration.project.LifecycleProjectEvaluator$NotifyAfterEvaluate$1.execute(LifecycleProjectEvaluator.java:190)
    18:24:45 at org.gradle.configuration.project.LifecycleProjectEvaluator$NotifyAfterEvaluate$1.execute(LifecycleProjectEvaluator.java:187)
    18:24:45 at org.gradle.api.internal.project.DefaultProject.stepEvaluationListener(DefaultProject.java:1419)
    18:24:45 at org.gradle.configuration.project.LifecycleProjectEvaluator$NotifyAfterEvaluate.run(LifecycleProjectEvaluator.java:196)
    18:24:45 at org.gradle.internal.operations.DefaultBuildOperationExecutor$RunnableBuildOperationWorker.execute(DefaultBuildOperationExecutor.java:301)
    18:24:45 at org.gradle.internal.operations.DefaultBuildOperationExecutor$RunnableBuildOperationWorker.execute(DefaultBuildOperationExecutor.java:293)
    18:24:45 at org.gradle.internal.operations.DefaultBuildOperationExecutor.execute(DefaultBuildOperationExecutor.java:175)
    18:24:45 at org.gradle.internal.operations.DefaultBuildOperationExecutor.run(DefaultBuildOperationExecutor.java:91)
    18:24:45 at org.gradle.internal.operations.DelegatingBuildOperationExecutor.run(DelegatingBuildOperationExecutor.java:31)
    18:24:45 at org.gradle.configuration.project.LifecycleProjectEvaluator$EvaluateProject$1.run(LifecycleProjectEvaluator.java:111)
    18:24:45 at org.gradle.internal.Factories$1.create(Factories.java:25)
    18:24:45 at org.gradle.internal.work.DefaultWorkerLeaseService.withLocks(DefaultWorkerLeaseService.java:183)
    18:24:45 at org.gradle.internal.work.StopShieldingWorkerLeaseService.withLocks(StopShieldingWorkerLeaseService.java:40)
    18:24:45 at org.gradle.api.internal.project.DefaultProjectStateRegistry$ProjectStateImpl.withProjectLock(DefaultProjectStateRegistry.java:226)
    18:24:45 at org.gradle.api.internal.project.DefaultProjectStateRegistry$ProjectStateImpl.withMutableState(DefaultProjectStateRegistry.java:220)
    18:24:45 at org.gradle.api.internal.project.DefaultProjectStateRegistry$ProjectStateImpl.withMutableState(DefaultProjectStateRegistry.java:186)
    18:24:45 at org.gradle.configuration.project.LifecycleProjectEvaluator$EvaluateProject.run(LifecycleProjectEvaluator.java:95)
    18:24:45 at org.gradle.internal.operations.DefaultBuildOperationExecutor$RunnableBuildOperationWorker.execute(DefaultBuildOperationExecutor.java:301)
    18:24:45 at org.gradle.internal.operations.DefaultBuildOperationExecutor$RunnableBuildOperationWorker.execute(DefaultBuildOperationExecutor.java:293)
    18:24:45 at org.gradle.internal.operations.DefaultBuildOperationExecutor.execute(DefaultBuildOperationExecutor.java:175)
    18:24:45 at org.gradle.internal.operations.DefaultBuildOperationExecutor.run(DefaultBuildOperationExecutor.java:91)
    18:24:45 at org.gradle.internal.operations.DelegatingBuildOperationExecutor.run(DelegatingBuildOperationExecutor.java:31)
    18:24:45 at org.gradle.configuration.project.LifecycleProjectEvaluator.evaluate(LifecycleProjectEvaluator.java:67)
    18:24:45 at org.gradle.api.internal.project.DefaultProject.evaluate(DefaultProject.java:693)
    18:24:45 at org.gradle.api.internal.project.DefaultProject.evaluate(DefaultProject.java:141)
    18:24:45 at org.gradle.execution.TaskPathProjectEvaluator.configure(TaskPathProjectEvaluator.java:35)
    18:24:45 at org.gradle.execution.TaskPathProjectEvaluator.configureHierarchy(TaskPathProjectEvaluator.java:62)
    18:24:45 at org.gradle.configuration.DefaultBuildConfigurer.configure(DefaultBuildConfigurer.java:41)
    18:24:45 at org.gradle.initialization.DefaultGradleLauncher$ConfigureBuild.run(DefaultGradleLauncher.java:302)
    18:24:45 at org.gradle.internal.operations.DefaultBuildOperationExecutor$RunnableBuildOperationWorker.execute(DefaultBuildOperationExecutor.java:301)
    18:24:45 at org.gradle.internal.operations.DefaultBuildOperationExecutor$RunnableBuildOperationWorker.execute(DefaultBuildOperationExecutor.java:293)
    18:24:45 at org.gradle.internal.operations.DefaultBuildOperationExecutor.execute(DefaultBuildOperationExecutor.java:175)
    18:24:45 at org.gradle.internal.operations.DefaultBuildOperationExecutor.run(DefaultBuildOperationExecutor.java:91)
    18:24:45 at org.gradle.internal.operations.DelegatingBuildOperationExecutor.run(DelegatingBuildOperationExecutor.java:31)
    18:24:45 at org.gradle.initialization.DefaultGradleLauncher.configureBuild(DefaultGradleLauncher.java:210)
    18:24:45 at org.gradle.initialization.DefaultGradleLauncher.doBuildStages(DefaultGradleLauncher.java:151)
    18:24:45 at org.gradle.initialization.DefaultGradleLauncher.executeTasks(DefaultGradleLauncher.java:134)
    18:24:45 at org.gradle.internal.invocation.GradleBuildController$1.execute(GradleBuildController.java:58)
    18:24:45 at org.gradle.internal.invocation.GradleBuildController$1.execute(GradleBuildController.java:55)
    18:24:45 at org.gradle.internal.invocation.GradleBuildController$3.create(GradleBuildController.java:82)
    18:24:45 at org.gradle.internal.invocation.GradleBuildController$3.create(GradleBuildController.java:75)
    18:24:45 at org.gradle.internal.work.DefaultWorkerLeaseService.withLocks(DefaultWorkerLeaseService.java:183)
    18:24:45 at org.gradle.internal.work.StopShieldingWorkerLeaseService.withLocks(StopShieldingWorkerLeaseService.java:40)
    18:24:45 at org.gradle.internal.invocation.GradleBuildController.doBuild(GradleBuildController.java:75)
    18:24:45 at org.gradle.internal.invocation.GradleBuildController.run(GradleBuildController.java:55)
    18:24:45 at org.gradle.tooling.internal.provider.ExecuteBuildActionRunner.run(ExecuteBuildActionRunner.java:31)
    18:24:45 at org.gradle.launcher.exec.ChainingBuildActionRunner.run(ChainingBuildActionRunner.java:35)
    18:24:45 at org.gradle.launcher.exec.BuildOutcomeReportingBuildActionRunner.run(BuildOutcomeReportingBuildActionRunner.java:58)
    18:24:45 at org.gradle.tooling.internal.provider.ValidatingBuildActionRunner.run(ValidatingBuildActionRunner.java:32)
    18:24:45 at org.gradle.launcher.exec.BuildCompletionNotifyingBuildActionRunner.run(BuildCompletionNotifyingBuildActionRunner.java:39)
    18:24:45 at org.gradle.launcher.exec.RunAsBuildOperationBuildActionRunner$3.call(RunAsBuildOperationBuildActionRunner.java:49)
    18:24:45 at org.gradle.launcher.exec.RunAsBuildOperationBuildActionRunner$3.call(RunAsBuildOperationBuildActionRunner.java:44)
    18:24:45 at org.gradle.internal.operations.DefaultBuildOperationExecutor$CallableBuildOperationWorker.execute(DefaultBuildOperationExecutor.java:315)
    18:24:45 at org.gradle.internal.operations.DefaultBuildOperationExecutor$CallableBuildOperationWorker.execute(DefaultBuildOperationExecutor.java:305)
    18:24:45 at org.gradle.internal.operations.DefaultBuildOperationExecutor.execute(DefaultBuildOperationExecutor.java:175)
    18:24:45 at org.gradle.internal.operations.DefaultBuildOperationExecutor.call(DefaultBuildOperationExecutor.java:101)
    18:24:45 at org.gradle.internal.operations.DelegatingBuildOperationExecutor.call(DelegatingBuildOperationExecutor.java:36)
    18:24:45 at org.gradle.launcher.exec.RunAsBuildOperationBuildActionRunner.run(RunAsBuildOperationBuildActionRunner.java:44)
    18:24:45 at org.gradle.launcher.exec.InProcessBuildActionExecuter$1.transform(InProcessBuildActionExecuter.java:49)
    18:24:45 at org.gradle.launcher.exec.InProcessBuildActionExecuter$1.transform(InProcessBuildActionExecuter.java:46)
    18:24:45 at org.gradle.composite.internal.DefaultRootBuildState.run(DefaultRootBuildState.java:78)
    18:24:45 at org.gradle.launcher.exec.InProcessBuildActionExecuter.execute(InProcessBuildActionExecuter.java:46)
    18:24:45 at org.gradle.launcher.exec.InProcessBuildActionExecuter.execute(InProcessBuildActionExecuter.java:31)
    18:24:45 at org.gradle.launcher.exec.BuildTreeScopeBuildActionExecuter.execute(BuildTreeScopeBuildActionExecuter.java:42)
    18:24:45 at org.gradle.launcher.exec.BuildTreeScopeBuildActionExecuter.execute(BuildTreeScopeBuildActionExecuter.java:28)
    18:24:45 at org.gradle.tooling.internal.provider.ContinuousBuildActionExecuter.execute(ContinuousBuildActionExecuter.java:78)
    18:24:45 at org.gradle.tooling.internal.provider.ContinuousBuildActionExecuter.execute(ContinuousBuildActionExecuter.java:52)
    18:24:45 at org.gradle.tooling.internal.provider.SubscribableBuildActionExecuter.execute(SubscribableBuildActionExecuter.java:59)
    18:24:45 at org.gradle.tooling.internal.provider.SubscribableBuildActionExecuter.execute(SubscribableBuildActionExecuter.java:36)
    18:24:45 at org.gradle.tooling.internal.provider.SessionScopeBuildActionExecuter.execute(SessionScopeBuildActionExecuter.java:68)
    18:24:45 at org.gradle.tooling.internal.provider.SessionScopeBuildActionExecuter.execute(SessionScopeBuildActionExecuter.java:38)
    18:24:45 at org.gradle.tooling.internal.provider.GradleThreadBuildActionExecuter.execute(GradleThreadBuildActionExecuter.java:37)
    18:24:45 at org.gradle.tooling.internal.provider.GradleThreadBuildActionExecuter.execute(GradleThreadBuildActionExecuter.java:26)
    18:24:45 at org.gradle.tooling.internal.provider.ParallelismConfigurationBuildActionExecuter.execute(ParallelismConfigurationBuildActionExecuter.java:43)
    18:24:45 at org.gradle.tooling.internal.provider.ParallelismConfigurationBuildActionExecuter.execute(ParallelismConfigurationBuildActionExecuter.java:29)
    18:24:45 at org.gradle.tooling.internal.provider.StartParamsValidatingActionExecuter.execute(StartParamsValidatingActionExecuter.java:60)
    18:24:45 at org.gradle.tooling.internal.provider.StartParamsValidatingActionExecuter.execute(StartParamsValidatingActionExecuter.java:32)
    18:24:45 at org.gradle.tooling.internal.provider.SessionFailureReportingActionExecuter.execute(SessionFailureReportingActionExecuter.java:55)
    18:24:45 at org.gradle.tooling.internal.provider.SessionFailureReportingActionExecuter.execute(SessionFailureReportingActionExecuter.java:41)
    18:24:45 at org.gradle.tooling.internal.provider.SetupLoggingActionExecuter.execute(SetupLoggingActionExecuter.java:48)
    18:24:45 at org.gradle.tooling.internal.provider.SetupLoggingActionExecuter.execute(SetupLoggingActionExecuter.java:32)
    18:24:45 at org.gradle.launcher.daemon.server.exec.ExecuteBuild.doBuild(ExecuteBuild.java:67)
    18:24:45 at org.gradle.launcher.daemon.server.exec.BuildCommandOnly.execute(BuildCommandOnly.java:36)
    18:24:45 at org.gradle.launcher.daemon.server.api.DaemonCommandExecution.proceed(DaemonCommandExecution.java:104)
    18:24:45 at org.gradle.launcher.daemon.server.exec.WatchForDisconnection.execute(WatchForDisconnection.java:37)
    18:24:45 at org.gradle.launcher.daemon.server.api.DaemonCommandExecution.proceed(DaemonCommandExecution.java:104)
    18:24:45 at org.gradle.launcher.daemon.server.exec.ResetDeprecationLogger.execute(ResetDeprecationLogger.java:26)
    18:24:45 at org.gradle.launcher.daemon.server.api.DaemonCommandExecution.proceed(DaemonCommandExecution.java:104)
    18:24:45 at org.gradle.launcher.daemon.server.exec.RequestStopIfSingleUsedDaemon.execute(RequestStopIfSingleUsedDaemon.java:34)
    18:24:45 at org.gradle.launcher.daemon.server.api.DaemonCommandExecution.proceed(DaemonCommandExecution.java:104)
    18:24:45 at org.gradle.launcher.daemon.server.exec.ForwardClientInput$2.call(ForwardClientInput.java:74)
    18:24:45 at org.gradle.launcher.daemon.server.exec.ForwardClientInput$2.call(ForwardClientInput.java:72)
    18:24:45 at org.gradle.util.Swapper.swap(Swapper.java:38)
    18:24:45 at org.gradle.launcher.daemon.server.exec.ForwardClientInput.execute(ForwardClientInput.java:72)
    18:24:45 at org.gradle.launcher.daemon.server.api.DaemonCommandExecution.proceed(DaemonCommandExecution.java:104)
    18:24:45 at org.gradle.launcher.daemon.server.exec.LogAndCheckHealth.execute(LogAndCheckHealth.java:55)
    18:24:45 at org.gradle.launcher.daemon.server.api.DaemonCommandExecution.proceed(DaemonCommandExecution.java:104)
    18:24:45 at org.gradle.launcher.daemon.server.exec.LogToClient.doBuild(LogToClient.java:62)
    18:24:45 at org.gradle.launcher.daemon.server.exec.BuildCommandOnly.execute(BuildCommandOnly.java:36)
    18:24:45 at org.gradle.launcher.daemon.server.api.DaemonCommandExecution.proceed(DaemonCommandExecution.java:104)
    18:24:45 at org.gradle.launcher.daemon.server.exec.EstablishBuildEnvironment.doBuild(EstablishBuildEnvironment.java:81)
    18:24:45 at org.gradle.launcher.daemon.server.exec.BuildCommandOnly.execute(BuildCommandOnly.java:36)
    18:24:45 at org.gradle.launcher.daemon.server.api.DaemonCommandExecution.proceed(DaemonCommandExecution.java:104)
    18:24:45 at org.gradle.launcher.daemon.server.exec.StartBuildOrRespondWithBusy$1.run(StartBuildOrRespondWithBusy.java:50)
    18:24:45 at org.gradle.launcher.daemon.server.DaemonStateCoordinator$1.run(DaemonStateCoordinator.java:295)
    18:24:45 at org.gradle.internal.concurrent.ExecutorPolicy$CatchAndRecordFailures.onExecute(ExecutorPolicy.java:63)
    18:24:45 at org.gradle.internal.concurrent.ManagedExecutorImpl$1.run(ManagedExecutorImpl.java:46)
    18:24:45 at java.util.concurrent.ThreadPoolExecutor.runWorker(ThreadPoolExecutor.java:1149)
    18:24:45 at java.util.concurrent.ThreadPoolExecutor$Worker.run(ThreadPoolExecutor.java:624)
    18:24:45 at org.gradle.internal.concurrent.ThreadFactoryImpl$ManagedThreadRunnable.run(ThreadFactoryImpl.java:55)
    18:24:45 at java.lang.Thread.run(Thread.java:748)
    18:24:45
    18:24:45 unexpected element (uri:"", local:"base-extension"). Expected elements are <{}codename>,<{}layoutlib>,<{}api-level>
    18:24:45 [SafeDK] Your project has been updated to support Multi-Dex!
    18:24:45 With Multi-Dex support you can use as many methods as you like in your application (no 65K method limit)
    18:24:45
    18:24:45 > Configure project :unityLibrary
    18:24:45 WARNING: The option setting 'android.bundle.enableUncompressedNativeLibs=false' is experimental and unsupported.
    18:24:45 The current default is 'true'.
    18:24:45
    18:24:45 WARNING: The specified Android SDK Build Tools version (26.0.0) is ignored, as it is below the minimum supported version (28.0.3) for Android Gradle Plugin 3.4.3.
    18:24:45 Android SDK Build Tools 28.0.3 will be used.
    18:24:45 To suppress this warning, remove "buildToolsVersion '26.0.0'" from your build.gradle file, as each version of the Android Gradle Plugin now has a default version of the build tools.
    18:24:45
    18:24:45 > Configure project :unityLibrary:Firebase
    18:24:45 WARNING: The option setting 'android.bundle.enableUncompressedNativeLibs=false' is experimental and unsupported.
    18:24:45 The current default is 'true'.
    18:24:45
    18:24:45
    18:24:45 > Configure project :unityLibrary:FirebaseApp.androidlib
    18:24:45 WARNING: The option setting 'android.bundle.enableUncompressedNativeLibs=false' is experimental and unsupported.
    18:24:45 The current default is 'true'.
    18:24:45
    18:24:45
    18:24:45 > Configure project :unityLibrary:MaxMediationGoogle.androidlib
    18:24:45 WARNING: The option setting 'android.bundle.enableUncompressedNativeLibs=false' is experimental and unsupported.
    18:24:45 The current default is 'true'.
    18:24:45
    18:24:45
    18:24:45 > Configure project :unityLibrary:unity-android-resources
    18:24:45 WARNING: The option setting 'android.bundle.enableUncompressedNativeLibs=false' is experimental and unsupported.
    18:24:45 The current default is 'true'.
    18:24:45
    18:24:45
    18:24:45 > Task :unityLibrary:MaxMediationGoogle.androidlib:preBuild UP-TO-DATE
    18:24:45 > Task :unityLibrary:FirebaseApp.androidlib:preBuild UP-TO-DATE
    18:24:45 > Task :unityLibrary:unity-android-resources:preBuild UP-TO-DATE
    18:24:45 > Task :unityLibrary:preBuild UP-TO-DATE
    18:24:45 > Task :unityLibrary:Firebase:preBuild UP-TO-DATE
    18:24:45 > Task :launcher:preBuild UP-TO-DATE
    18:24:45 > Task :unityLibrary:MaxMediationGoogle.androidlib:preReleaseBuild UP-TO-DATE
    18:24:45 > Task :unityLibrary:Firebase:preReleaseBuild UP-TO-DATE
    18:24:45 > Task :unityLibrary:preReleaseBuild UP-TO-DATE
    18:24:45 > Task :unityLibrary:FirebaseApp.androidlib:preReleaseBuild UP-TO-DATE
    18:24:45 > Task :unityLibrary:unity-android-resources:preReleaseBuild UP-TO-DATE
    18:24:45 > Task :unityLibrary:unity-android-resources:checkReleaseManifest
    18:24:45 > Task :unityLibrary:FirebaseApp.androidlib:checkReleaseManifest
    18:24:45 > Task :unityLibrary:MaxMediationGoogle.androidlib:checkReleaseManifest
    18:24:45 > Task :unityLibrary:Firebase:checkReleaseManifest
    18:24:45 > Task :unityLibrary:checkReleaseManifest
    18:24:45
    18:24:45 > Task :unityLibrary:processReleaseManifest
    18:24:45 D:\jenkins\workspace\BingoBash_Android_Binary\BingoBash\Temp\gradleOut\unityLibrary\src\main\AndroidManifest.xml:5:5-22:16 Warning:
    18:24:45 activity#com.google.firebase.MessagingUnityPlayerActivity@android:allowBackup was tagged at AndroidManifest.xml:5 to replace other declarations but no other declaration present
    18:24:45 D:\jenkins\workspace\BingoBash_Android_Binary\BingoBash\Temp\gradleOut\unityLibrary\src\main\AndroidManifest.xml:66:3-99 Warning:
    18:24:45 uses-permission#android.permission.WRITE_EXTERNAL_STORAGE was tagged at AndroidManifest.xml:66 to remove other declarations but no other declaration present
    18:24:45
    18:24:45 > Task :unityLibrary:packageReleaseRenderscript NO-SOURCE
    18:24:45 > Task :unityLibrary:unity-android-resources:processReleaseManifest
    18:24:45 > Task :unityLibrary:FirebaseApp.androidlib:processReleaseManifest
    18:24:45 > Task :unityLibrary:unity-android-resources:packageReleaseRenderscript NO-SOURCE
    18:24:45 > Task :unityLibrary:generateReleaseResValues
    18:24:45 > Task :unityLibrary:Firebase:processReleaseManifest
    18:24:45 > Task :unityLibrary:MaxMediationGoogle.androidlib:processReleaseManifest
    18:24:45 > Task :unityLibrary:FirebaseApp.androidlib:packageReleaseRenderscript NO-SOURCE
    18:24:45 > Task :unityLibrary:MaxMediationGoogle.androidlib:packageReleaseRenderscript NO-SOURCE
    18:24:45 > Task :unityLibrary:Firebase:packageReleaseRenderscript NO-SOURCE
    18:24:45 > Task :unityLibrary:unity-android-resources:compileReleaseRenderscript NO-SOURCE
    18:24:45 > Task :unityLibrary:FirebaseApp.androidlib:compileReleaseRenderscript NO-SOURCE
    18:24:45 > Task :unityLibrary:MaxMediationGoogle.androidlib:compileReleaseRenderscript NO-SOURCE
    18:24:45 > Task :unityLibrary:Firebase:compileReleaseRenderscript NO-SOURCE
    18:24:45 > Task :unityLibrary:compileReleaseRenderscript NO-SOURCE
    18:24:45 > Task :unityLibrary:generateReleaseResources
    18:24:45 > Task :unityLibrary:unity-android-resources:generateReleaseResValues
    18:24:45 > Task :unityLibrary:unity-android-resources:generateReleaseResources
    18:24:45 > Task :unityLibrary:MaxMediationGoogle.androidlib:generateReleaseResValues
    18:24:45 > Task :unityLibrary:Firebase:generateReleaseResValues
    18:24:45 > Task :unityLibrary:FirebaseApp.androidlib:generateReleaseResValues
    18:24:45 > Task :unityLibrary:FirebaseApp.androidlib:generateReleaseResources
    18:24:45 > Task :unityLibrary:Firebase:generateReleaseResources
    18:24:45 > Task :unityLibrary:MaxMediationGoogle.androidlib:generateReleaseResources
    18:24:45 > Task :unityLibrary:MaxMediationGoogle.androidlib:packageReleaseResources
    18:24:45 > Task :unityLibrary:FirebaseApp.androidlib:packageReleaseResources
    18:24:45 > Task :unityLibrary:Firebase:packageReleaseResources
    18:24:45 > Task :unityLibrary:packageReleaseResources
    18:24:45 > Task :unityLibrary:unity-android-resources:packageReleaseResources
    18:24:45 > Task :unityLibrary:mergeReleaseShaders
    18:24:45 > Task :unityLibrary:MaxMediationGoogle.androidlib:mergeReleaseShaders
    18:24:45 > Task :unityLibrary:unity-android-resources:mergeReleaseShaders
    18:24:45 > Task :unityLibrary:FirebaseApp.androidlib:mergeReleaseShaders
    18:24:45 > Task :unityLibrary:Firebase:mergeReleaseShaders
    18:24:45 > Task :unityLibrary:unity-android-resources:compileReleaseShaders
    18:24:45 > Task :unityLibrary:compileReleaseShaders
    18:24:45 > Task :unityLibrary:FirebaseApp.androidlib:compileReleaseShaders
    18:24:45 > Task :unityLibrary:MaxMediationGoogle.androidlib:compileReleaseShaders
    18:24:45 > Task :unityLibrary:FirebaseApp.androidlib:generateReleaseAssets
    18:24:45 > Task :unityLibrary:Firebase:compileReleaseShaders
    18:24:45 > Task :unityLibrary:unity-android-resources:generateReleaseAssets
    18:24:45 > Task :unityLibrary:generateReleaseAssets
    18:24:45 > Task :unityLibrary:MaxMediationGoogle.androidlib:generateReleaseAssets
    18:24:45 > Task :unityLibrary:Firebase:generateReleaseAssets
    18:24:45 > Task :unityLibrary:FirebaseApp.androidlib:packageReleaseAssets
    18:24:45 > Task :unityLibrary:MaxMediationGoogle.androidlib:packageReleaseAssets
    18:24:45 > Task :unityLibrary:unity-android-resources:packageReleaseAssets
    18:24:45 > Task :unityLibrary:Firebase:packageReleaseAssets
    18:24:45 > Task :unityLibrary:Firebase:compileReleaseAidl NO-SOURCE
    18:24:45 > Task :unityLibrary:MaxMediationGoogle.androidlib:compileReleaseAidl NO-SOURCE
    18:24:45 > Task :unityLibrary:unity-android-resources:compileReleaseAidl NO-SOURCE
    18:24:45 > Task :unityLibrary:FirebaseApp.androidlib:compileReleaseAidl NO-SOURCE
    18:24:45 > Task :launcher:preReleaseBuild
    18:24:45 > Task :launcher:compileReleaseRenderscript NO-SOURCE
    18:24:45 > Task :launcher:generateReleaseResValues
    18:24:45 > Task :launcher:generateReleaseResources
    18:24:45 > Task :unityLibrary:packageReleaseAssets
    18:24:45 > Task :unityLibrary:compileReleaseAidl NO-SOURCE
    18:24:45 > Task :unityLibrary:generateReleaseBuildConfig
    18:24:45 > Task :unityLibrary:prepareLintJar
    18:24:45 > Task :unityLibrary:generateReleaseSources
    18:24:45 > Task :unityLibrary:Firebase:generateReleaseRFile
    18:24:45 > Task :unityLibrary:MaxMediationGoogle.androidlib:generateReleaseRFile
    18:24:45 > Task :unityLibrary:FirebaseApp.androidlib:generateReleaseRFile
    18:24:45 > Task :unityLibrary:unity-android-resources:generateReleaseRFile
    18:24:45 > Task :unityLibrary:Firebase:generateReleaseBuildConfig
    18:24:45 > Task :unityLibrary:MaxMediationGoogle.androidlib:generateReleaseBuildConfig
    18:24:45 > Task :unityLibrary:FirebaseApp.androidlib:generateReleaseBuildConfig
    18:24:45 > Task :unityLibrary:unity-android-resources:generateReleaseBuildConfig
    18:24:45 > Task :unityLibrary:Firebase:prepareLintJar
    18:24:45 > Task :unityLibrary:Firebase:generateReleaseSources
    18:24:45 > Task :unityLibrary:MaxMediationGoogle.androidlib:prepareLintJar
    18:24:45 > Task :unityLibrary:MaxMediationGoogle.androidlib:generateReleaseSources
    18:24:45 > Task :unityLibrary:unity-android-resources:prepareLintJar
    18:24:45 > Task :unityLibrary:unity-android-resources:generateReleaseSources
    18:24:45 > Task :unityLibrary:FirebaseApp.androidlib:prepareLintJar
    18:24:45 > Task :unityLibrary:FirebaseApp.androidlib:generateReleaseSources
    18:24:45 > Task :unityLibrary:MaxMediationGoogle.androidlib:javaPreCompileRelease
    18:24:45 > Task :unityLibrary:unity-android-resources:javaPreCompileRelease
    18:24:45 > Task :unityLibrary:Firebase:javaPreCompileRelease
    18:24:45 > Task :unityLibrary:FirebaseApp.androidlib:javaPreCompileRelease
    18:24:45 > Task :unityLibrary:generateReleaseRFile
    18:24:45 > Task :unityLibrary:Firebase:compileReleaseJavaWithJavac
    18:24:45 > Task :unityLibrary:FirebaseApp.androidlib:compileReleaseJavaWithJavac
    18:24:45 > Task :unityLibrary:MaxMediationGoogle.androidlib:compileReleaseJavaWithJavac
    18:24:45 > Task :unityLibrary:unity-android-resources:compileReleaseJavaWithJavac
    18:24:45 > Task :unityLibrary:processReleaseJavaRes NO-SOURCE
    18:24:45 > Task :unityLibrary:FirebaseApp.androidlib:bundleLibCompileRelease
    18:24:45 > Task :unityLibrary:unity-android-resources:bundleLibCompileRelease
    18:24:45 > Task :unityLibrary:MaxMediationGoogle.androidlib:bundleLibCompileRelease
    18:24:45 > Task :unityLibrary:Firebase:bundleLibCompileRelease
    18:24:45 > Task :unityLibrary:FirebaseApp.androidlib:bundleLibRuntimeRelease
    18:24:45 > Task :unityLibrary:unity-android-resources:bundleLibRuntimeRelease
    18:24:45 > Task :unityLibrary:Firebase:bundleLibRuntimeRelease
    18:24:45 > Task :unityLibrary:MaxMediationGoogle.androidlib:bundleLibRuntimeRelease
    18:24:45 > Task :unityLibrary:FirebaseApp.androidlib:processReleaseJavaRes NO-SOURCE
    18:24:45 > Task :unityLibrary:Firebase:processReleaseJavaRes NO-SOURCE
    18:24:45 > Task :unityLibrary:unity-android-resources:processReleaseJavaRes NO-SOURCE
    18:24:45 > Task :unityLibrary:MaxMediationGoogle.androidlib:processReleaseJavaRes NO-SOURCE
    18:24:45 > Task :unityLibrary:Firebase:bundleLibResRelease
    18:24:45 > Task :unityLibrary:FirebaseApp.androidlib:bundleLibResRelease
    18:24:45 > Task :unityLibrary:MaxMediationGoogle.androidlib:bundleLibResRelease
    18:24:45 > Task :unityLibrary:Firebase:mergeReleaseJniLibFolders
    18:24:45 > Task :unityLibrary:FirebaseApp.androidlib:mergeReleaseJniLibFolders
    18:24:45 > Task :unityLibrary:MaxMediationGoogle.androidlib:mergeReleaseJniLibFolders
    18:24:45 > Task :unityLibrary:MaxMediationGoogle.androidlib:transformNativeLibsWithMergeJniLibsForRelease
    18:24:45 > Task :unityLibrary:FirebaseApp.androidlib:transformNativeLibsWithMergeJniLibsForRelease
    18:24:45 > Task :unityLibrary:Firebase:transformNativeLibsWithMergeJniLibsForRelease
    18:24:45 > Task :unityLibrary:Firebase:transformNativeLibsWithStripDebugSymbolForRelease
    18:24:45 > Task :unityLibrary:MaxMediationGoogle.androidlib:transformNativeLibsWithStripDebugSymbolForRelease
    18:24:45 > Task :unityLibrary:FirebaseApp.androidlib:transformNativeLibsWithStripDebugSymbolForRelease
    18:24:45 > Task :unityLibrary:Firebase:transformNativeLibsWithIntermediateJniLibsForRelease
    18:24:45 > Task :unityLibrary:MaxMediationGoogle.androidlib:transformNativeLibsWithIntermediateJniLibsForRelease
    18:24:45 > Task :unityLibrary:FirebaseApp.androidlib:transformNativeLibsWithIntermediateJniLibsForRelease
    18:24:45 > Task :launcher:mergeReleaseResources
    18:24:45 > Task :launcher:checkReleaseManifest
    18:24:45 > Task :launcher:createReleaseCompatibleScreenManifests
    18:24:45 > Task :launcher:mainApkListPersistenceRelease
    18:24:45 > Task :unityLibrary:unity-android-resources:bundleLibResRelease
    18:24:45 > Task :unityLibrary:unity-android-resources:mergeReleaseJniLibFolders
    18:24:45 > Task :unityLibrary:unity-android-resources:transformNativeLibsWithMergeJniLibsForRelease
    18:24:45 > Task :unityLibrary:unity-android-resources:transformNativeLibsWithStripDebugSymbolForRelease
    18:24:45 > Task :unityLibrary:unity-android-resources:transformNativeLibsWithIntermediateJniLibsForRelease
    18:24:45 > Task :unityLibrary:mergeReleaseJniLibFolders
    18:24:45
    18:24:45 > Task :launcher:processReleaseManifest
    18:24:45 D:\jenkins\workspace\BingoBash_Android_Binary\BingoBash\Temp\gradleOut\launcher\src\main\AndroidManifest.xml:54:9-93:20 Warning:
    18:24:45 activity#com.google.firebase.MessagingUnityPlayerActivity@android:allowBackup was tagged at AndroidManifest.xml:54 to replace other declarations but no other declaration present
    18:24:45 D:\jenkins\workspace\BingoBash_Android_Binary\BingoBash\Temp\gradleOut\launcher\src\main\AndroidManifest.xml:38:5-40:31 Warning:
    18:24:45 uses-permission#android.permission.WRITE_EXTERNAL_STORAGE was tagged at AndroidManifest.xml:38 to remove other declarations but no other declaration present
    18:24:45
    18:24:45 > Task :unityLibrary:javaPreCompileRelease
    18:24:45 > Task :launcher:bundleReleaseResources
    18:24:45 > Task :launcher:mergeReleaseShaders
    18:24:45 > Task :launcher:compileReleaseShaders
    18:24:45 > Task :launcher:generateReleaseAssets
    18:24:45 > Task :launcher:mergeReleaseAssets
    18:24:45 > Task :launcher:checkReleaseDuplicateClasses
    18:24:45 > Task :launcher:compileReleaseAidl NO-SOURCE
    18:24:45 > Task :launcher:generateReleaseBuildConfig
    18:24:45 > Task :launcher:prepareLintJar
    18:24:45 > Task :launcher:generateReleaseSources
    18:24:45 > Task :launcher:processReleaseResources
    18:24:45 > Task :launcher:mergeReleaseJniLibFolders
    18:24:45 > Task :launcher:processReleaseJavaRes NO-SOURCE
    18:24:45 > Task :launcher:collectReleaseDependencies
    18:24:45 > Task :launcher:configureReleaseDependencies
    18:24:45 > Task :launcher:validateSigningRelease
    18:24:45 > Task :launcher:signingConfigWriterRelease
    18:24:45 > Task :unityLibrary:compileReleaseJavaWithJavac
    18:24:45 > Task :unityLibrary:bundleLibCompileRelease
    18:24:45 > Task :launcher:javaPreCompileRelease
    18:24:45 > Task :unityLibrary:bundleLibRuntimeRelease
    18:24:45 > Task :unityLibrary:bundleLibResRelease
    18:24:45
    18:24:45 > Task :launcher:compileReleaseJavaWithJavac FAILED
    18:24:45
    18:24:45 > Task :unityLibrary:transformNativeLibsWithMergeJniLibsForRelease
    18:24:45
    18:24:45 Deprecated Gradle features were used in this build, making it incompatible with Gradle 6.0.
    18:24:45 Use '--warning-mode all' to show the individual deprecation warnings.
    18:24:45 See https://docs.gradle.org/5.1.1/userguide/command_line_interface.html#sec:command_line_warnings
    18:24:45 115 actionable tasks: 115 executed
    18:24:45
    18:24:45 0x00007FF71C72258C (Unity) StackWalker::GetCurrentCallstack
    18:24:45 0x00007FF71C726531 (Unity) StackWalker::ShowCallstack
    18:24:45 0x00007FF71AD85AE5 (Unity) GetStacktrace
    18:24:45 0x00007FF71D3DFFCE (Unity) DebugStringToFile
    18:24:45 0x00007FF71C786131 (Unity) DebugLogHandler_CUSTOM_Internal_Log
    18:24:45 0x000001CDEF150B8B (Mono JIT Code) (wrapper managed-to-native) UnityEngine.DebugLogHandler:Internal_Log (UnityEngine.LogType,UnityEngine.LogOption,string,UnityEngine.Object)
    18:24:45 0x000001CDEF150A2B (Mono JIT Code) UnityEngine.DebugLogHandler:LogFormat (UnityEngine.LogType,UnityEngine.Object,string,object[])
    18:24:45 0x000001CDEF0AFF1E (Mono JIT Code) UnityEngine.Logger:Log (UnityEngine.LogType,object)
    18:24:45 0x000001CE90E01EFA (Mono JIT Code) UnityEngine.Debug:LogError (object)
    18:24:45 0x000001CE90E012B3 (Mono JIT Code) UnityEditor.Android.GradleInvokationException:ParseAndShowException ()
    18:24:45 0x000001CE90B538BB (Mono JIT Code) UnityEditor.Android.PostProcessor.PostProcessRunner:RunAllTasks (UnityEditor.Android.PostProcessor.PostProcessorContext)
    18:24:45 0x000001CE90C884BB (Mono JIT Code) UnityEditor.Android.PostProcessAndroidPlayer:PostProcess (UnityEditor.BuildTarget,string,string,string,string,string,string,UnityEditor.BuildOptions,UnityEditor.RuntimeClassRegistry,UnityEditor.Build.Reporting.BuildReport)
    18:24:45 0x000001CE90C85E9B (Mono JIT Code) UnityEditor.Android.AndroidBuildPostprocessor:PostProcess (UnityEditor.Modules.BuildPostProcessArgs,UnityEditor.BuildProperties&)
    18:24:45 0x000001CE90C85002 (Mono JIT Code) UnityEditor.PostprocessBuildPlayer:Postprocess (UnityEditor.BuildTargetGroup,UnityEditor.BuildTarget,string,string,string,int,int,UnityEditor.BuildOptions,UnityEditor.RuntimeClassRegistry,UnityEditor.Build.Reporting.BuildReport)
    18:24:45 0x000001CE90C85630 (Mono JIT Code) (wrapper runtime-invoke) <Module>:runtime_invoke_void_int_int_object_object_object_int_int_int_object_object (object,intptr,intptr,intptr)
    18:24:45 0x00007FFB2893E280 (mono-2.0-bdwgc) [mini-runtime.c:2813] mono_jit_runtime_invoke
    18:24:45 0x00007FFB288C2AE2 (mono-2.0-bdwgc) [object.c:2921] do_runtime_invoke
    18:24:45 0x00007FFB288CBB3F (mono-2.0-bdwgc) [object.c:2968] mono_runtime_invoke
    18:24:45 0x00007FF71C693F3E (Unity) scripting_method_invoke
    18:24:45 0x00007FF71C68D98D (Unity) ScriptingInvocation::Invoke
    18:24:45 0x00007FF71A5A76B5 (Unity) CallMono
    18:24:45 0x00007FF71A5C536D (Unity) PostprocessPlayer
    18:24:45 0x00007FF71A5B02DD (Unity) DoBuildPlayer_PostBuild
    18:24:45 0x00007FF71A59E2CB (Unity) BuildPlayer
    18:24:45 0x00007FF71B3EC008 (Unity) BuildPipeline::BuildPlayerInternalNoCheck
    18:24:45 0x00007FF71B3E9D0E (Unity) BuildPipeline_CUSTOM_BuildPlayerInternalNoCheck
    18:24:45 0x000001CE8F535E33 (Mono JIT Code) (wrapper managed-to-native) UnityEditor.BuildPipeline:BuildPlayerInternalNoCheck (string[],string,string,UnityEditor.BuildTargetGroup,UnityEditor.BuildTarget,UnityEditor.BuildOptions,bool)
    18:24:45 0x000001CE8F534CA3 (Mono JIT Code) UnityEditor.BuildPipeline:BuildPlayerInternal (string[],string,string,UnityEditor.BuildTargetGroup,UnityEditor.BuildTarget,UnityEditor.BuildOptions)
    18:24:45 0x000001CE8F534223 (Mono JIT Code) UnityEditor.BuildPipeline:BuildPlayer (string[],string,string,UnityEditor.BuildTargetGroup,UnityEditor.BuildTarget,UnityEditor.BuildOptions)
    18:24:45 0x000001CE8F53351B (Mono JIT Code) UnityEditor.BuildPipeline:BuildPlayer (UnityEditor.BuildPlayerOptions)
    18:24:45 0x000001CE8F532213 (Mono JIT Code) UnityEditor.BuildPipeline:BuildPlayer (UnityEditor.EditorBuildSettingsScene[],string,UnityEditor.BuildTarget,UnityEditor.BuildOptions)
    18:24:45 0x000001CDC242A48B (Mono JIT Code) [BuildPlatform.cs:84] Gsn.Bingo.Build.BuildPlatform:BuildWithParameters (System.Collections.Generic.Dictionary`2<string, System.Collections.Generic.IEnumerable`1<string>>)
    18:24:45 0x000001CDC24227D3 (Mono JIT Code) [BuildCLI.cs:92] Gsn.Bingo.Build.BuildCLI:BuildWithOptions ()
    18:24:45 0x000001CDEF2FF685 (Mono JIT Code) (wrapper runtime-invoke) object:runtime_invoke_void (object,intptr,intptr,intptr)
    18:24:45 0x00007FFB2893E280 (mono-2.0-bdwgc) [mini-runtime.c:2813] mono_jit_runtime_invoke
    18:24:45 0x00007FFB288C2AE2 (mono-2.0-bdwgc) [object.c:2921] do_runtime_invoke
    18:24:45 0x00007FFB288CBB3F (mono-2.0-bdwgc) [object.c:2968] mono_runtime_invoke
    18:24:45 0x00007FF71C693F3E (Unity) scripting_method_invoke
    18:24:45 0x00007FF71C68D98D (Unity) ScriptingInvocation::Invoke
    18:24:45 0x00007FF71A403C00 (Unity) Application::ParseARGVCommands
    18:24:45 0x00007FF71A3FB1DE (Unity) Application::FinishLoadingProject
    18:24:45 0x00007FF71ADB5493 (Unity) WinMain
    18:24:45 0x00007FF71DEA9472 (Unity) __scrt_common_main_seh
    18:24:45 0x00007FFB59F27974 (KERNEL32) BaseThreadInitThunk
    18:24:45 0x00007FFB5C9DA2F1 (ntdll) RtlUserThreadStart
    18:24:45
    18:24:45 (Filename: C:\buildslave\unity\build\Runtime/Export/Debug/Debug.bindings.h Line: 39)
    18:24:45
    18:24:45 An exception has occurred in the compiler (1.8.0-adoptopenjdk). Please file a bug against the Java compiler via the Java bug reporting page (http://bugreport.java.com) after checking the Bug Database (http://bugs.java.com) for duplicates. Include your program and the following diagnostic in your report. Thank you.
    18:24:45 java.lang.AssertionError: annotationType(): unrecognized Attribute name MODULE (class com.sun.tools.javac.util.UnsharedNameTable$NameImpl)
    18:24:45 at com.sun.tools.javac.util.Assert.error(Assert.java:133)
    18:24:45 at com.sun.tools.javac.code.TypeAnnotations.annotationType(TypeAnnotations.java:231)
    18:24:45 at com.sun.tools.javac.code.TypeAnnotations$TypeAnnotationPositions.separateAnnotationsKinds(TypeAnnotations.java:294)
    18:24:45 at com.sun.tools.javac.code.TypeAnnotations$TypeAnnotationPositions.visitVarDef(TypeAnnotations.java:1164)
    18:24:45 at com.sun.tools.javac.tree.JCTree$JCVariableDecl.accept(JCTree.java:852)
    18:24:45 at com.sun.tools.javac.tree.TreeScanner.scan(TreeScanner.java:49)
    18:24:45 at com.sun.tools.javac.code.TypeAnnotations$TypeAnnotationPositions.scan(TypeAnnotations.java:275)
    18:24:45 at com.sun.tools.javac.tree.TreeScanner.scan(TreeScanner.java:57)
    18:24:45 at com.sun.tools.javac.code.TypeAnnotations$TypeAnnotationPositions.visitClassDef(TypeAnnotations.java:1042)
    18:24:45 at com.sun.tools.javac.tree.JCTree$JCClassDecl.accept(JCTree.java:693)
    18:24:45 at com.sun.tools.javac.tree.TreeScanner.scan(TreeScanner.java:49)
    18:24:45 at com.sun.tools.javac.code.TypeAnnotations$TypeAnnotationPositions.scan(TypeAnnotations.java:275)
    18:24:45 at com.sun.tools.javac.code.TypeAnnotations$1.run(TypeAnnotations.java:127)
    18:24:45 at com.sun.tools.javac.comp.Annotate.flush(Annotate.java:152)
    18:24:45 at com.sun.tools.javac.comp.Annotate.enterDone(Annotate.java:129)
    18:24:45 at com.sun.tools.javac.comp.Enter.complete(Enter.java:512)
    18:24:45 at com.sun.tools.javac.comp.Enter.main(Enter.java:471)
    18:24:45 at com.sun.tools.javac.main.JavaCompiler.enterTrees(JavaCompiler.java:982)
    18:24:45 at com.sun.tools.javac.main.JavaCompiler.compile(JavaCompiler.java:857)
    18:24:45 at com.sun.tools.javac.main.Main.compile(Main.java:523)
    18:24:45 at com.sun.tools.javac.api.JavacTaskImpl.doCall(JavacTaskImpl.java:129)
    18:24:45 at com.sun.tools.javac.api.JavacTaskImpl.call(JavacTaskImpl.java:138)
    18:24:45 at org.gradle.api.internal.tasks.compile.AnnotationProcessingCompileTask.call(AnnotationProcessingCompileTask.java:91)
    18:24:45 at org.gradle.api.internal.tasks.compile.ResourceCleaningCompilationTask.call(ResourceCleaningCompilationTask.java:57)
    18:24:45 at org.gradle.api.internal.tasks.compile.JdkJavaCompiler.execute(JdkJavaCompiler.java:50)
    18:24:45 at org.gradle.api.internal.tasks.compile.JdkJavaCompiler.execute(JdkJavaCompiler.java:36)
    18:24:45 at org.gradle.api.internal.tasks.compile.NormalizingJavaCompiler.delegateAndHandleErrors(NormalizingJavaCompiler.java:100)
    18:24:45 at org.gradle.api.internal.tasks.compile.NormalizingJavaCompiler.execute(NormalizingJavaCompiler.java:52)
    18:24:45 at org.gradle.api.internal.tasks.compile.NormalizingJavaCompiler.execute(NormalizingJavaCompiler.java:38)
    18:24:45 at org.gradle.api.internal.tasks.compile.AnnotationProcessorDiscoveringCompiler.execute(AnnotationProcessorDiscoveringCompiler.java:51)
    18:24:45 at org.gradle.api.internal.tasks.compile.AnnotationProcessorDiscoveringCompiler.execute(AnnotationProcessorDiscoveringCompiler.java:37)
    18:24:45 at org.gradle.api.internal.tasks.compile.CleaningJavaCompilerSupport.execute(CleaningJavaCompilerSupport.java:39)
    18:24:45 at org.gradle.api.internal.tasks.compile.incremental.IncrementalCompilerFactory$2.execute(IncrementalCompilerFactory.java:110)
    18:24:45 at org.gradle.api.internal.tasks.compile.incremental.IncrementalCompilerFactory$2.execute(IncrementalCompilerFactory.java:106)
    18:24:45 at org.gradle.api.internal.tasks.compile.incremental.IncrementalResultStoringCompiler.execute(IncrementalResultStoringCompiler.java:59)
    18:24:45 at org.gradle.api.internal.tasks.compile.incremental.IncrementalResultStoringCompiler.execute(IncrementalResultStoringCompiler.java:43)
    18:24:45 at org.gradle.api.internal.tasks.compile.CompileJavaBuildOperationReportingCompiler$2.call(CompileJavaBuildOperationReportingCompiler.java:59)
    18:24:45 at org.gradle.api.internal.tasks.compile.CompileJavaBuildOperationReportingCompiler$2.call(CompileJavaBuildOperationReportingCompiler.java:51)
    18:24:45 at org.gradle.internal.operations.DefaultBuildOperationExecutor$CallableBuildOperationWorker.execute(DefaultBuildOperationExecutor.java:315)
    18:24:45 at org.gradle.internal.operations.DefaultBuildOperationExecutor$CallableBuildOperationWorker.execute(DefaultBuildOperationExecutor.java:305)
    18:24:45 at org.gradle.internal.operations.DefaultBuildOperationExecutor.execute(DefaultBuildOperationExecutor.java:175)
    18:24:45 at org.gradle.internal.operations.DefaultBuildOperationExecutor.call(DefaultBuildOperationExecutor.java:101)
    18:24:45 at org.gradle.internal.operations.DelegatingBuildOperationExecutor.call(DelegatingBuildOperationExecutor.java:36)
    18:24:45 at org.gradle.api.internal.tasks.compile.CompileJavaBuildOperationReportingCompiler.execute(CompileJavaBuildOperationReportingCompiler.java:51)
    18:24:45 at org.gradle.api.tasks.compile.JavaCompile.performCompilation(JavaCompile.java:154)
    18:24:45 at org.gradle.api.tasks.compile.JavaCompile.compile(JavaCompile.java:122)
    18:24:45 at com.android.build.gradle.tasks.AndroidJavaCompile.compile(AndroidJavaCompile.kt:214)
    18:24:45 at sun.reflect.NativeMethodAccessorImpl.invoke0(Native Method)
    18:24:45 at sun.reflect.NativeMethodAccessorImpl.invoke(NativeMethodAccessorImpl.java:62)
    18:24:45 at sun.reflect.DelegatingMethodAccessorImpl.invoke(DelegatingMethodAccessorImpl.java:43)
    18:24:45 at java.lang.reflect.Method.invoke(Method.java:498)
    18:24:45 at org.gradle.internal.reflect.JavaMethod.invoke(JavaMethod.java:73)
    18:24:45 at org.gradle.api.internal.project.taskfactory.IncrementalTaskAction.doExecute(IncrementalTaskAction.java:47)
    18:24:45 at org.gradle.api.internal.project.taskfactory.StandardTaskAction.execute(StandardTaskAction.java:41)
    18:24:45 at org.gradle.api.internal.project.taskfactory.StandardTaskAction.execute(StandardTaskAction.java:28)
    18:24:45 at org.gradle.api.internal.tasks.execution.ExecuteActionsTaskExecuter$2.run(ExecuteActionsTaskExecuter.java:284)
    18:24:45 at org.gradle.internal.operations.DefaultBuildOperationExecutor$RunnableBuildOperationWorker.execute(DefaultBuildOperationExecutor.java:301)
    18:24:45 at org.gradle.internal.operations.DefaultBuildOperationExecutor$RunnableBuildOperationWorker.execute(DefaultBuildOperationExecutor.java:293)
    18:24:45 at org.gradle.internal.operations.DefaultBuildOperationExecutor.execute(DefaultBuildOperationExecutor.java:175)
    18:24:45 at org.gradle.internal.operations.DefaultBuildOperationExecutor.run(DefaultBuildOperationExecutor.java:91)
    18:24:45 at org.gradle.internal.operations.DelegatingBuildOperationExecutor.run(DelegatingBuildOperationExecutor.java:31)
    18:24:45 at org.gradle.api.internal.tasks.execution.ExecuteActionsTaskExecuter.executeAction(ExecuteActionsTaskExecuter.java:273)
    18:24:45 at org.gradle.api.internal.tasks.execution.ExecuteActionsTaskExecuter.executeActions(ExecuteActionsTaskExecuter.java:258)
    18:24:45 at org.gradle.api.internal.tasks.execution.ExecuteActionsTaskExecuter.access$200(ExecuteActionsTaskExecuter.java:67)
    18:24:45 at org.gradle.api.internal.tasks.execution.ExecuteActionsTaskExecuter$TaskExecution.execute(ExecuteActionsTaskExecuter.java:145)
    18:24:45 at org.gradle.internal.execution.impl.steps.ExecuteStep.execute(ExecuteStep.java:49)
    18:24:45 at org.gradle.internal.execution.impl.steps.CancelExecutionStep.execute(CancelExecutionStep.java:34)
    18:24:45 at org.gradle.internal.execution.impl.steps.TimeoutStep.executeWithoutTimeout(TimeoutStep.java:69)
    18:24:45 at org.gradle.internal.execution.impl.steps.TimeoutStep.execute(TimeoutStep.java:49)
    18:24:45 at org.gradle.internal.execution.impl.steps.CatchExceptionStep.execute(CatchExceptionStep.java:33)
    18:24:45 at org.gradle.internal.execution.impl.steps.CreateOutputsStep.execute(CreateOutputsStep.java:50)
    18:24:45 at org.gradle.internal.execution.impl.steps.SnapshotOutputStep.execute(SnapshotOutputStep.java:43)
    18:24:45 at org.gradle.internal.execution.impl.steps.SnapshotOutputStep.execute(SnapshotOutputStep.java:29)
    18:24:45 at org.gradle.internal.execution.impl.steps.CacheStep.executeWithoutCache(CacheStep.java:134)
    18:24:45 at org.gradle.internal.execution.impl.steps.CacheStep.lambda$execute$3(CacheStep.java:83)
    18:24:45 at java.util.Optional.orElseGet(Optional.java:267)
    18:24:45 at org.gradle.internal.execution.impl.steps.CacheStep.execute(CacheStep.java:82)
    18:24:45 at org.gradle.internal.execution.impl.steps.CacheStep.execute(CacheStep.java:36)
    18:24:45 at org.gradle.internal.execution.impl.steps.PrepareCachingStep.execute(PrepareCachingStep.java:33)
    18:24:45 at org.gradle.internal.execution.impl.steps.StoreSnapshotsStep.execute(StoreSnapshotsStep.java:38)
    18:24:45 at org.gradle.internal.execution.impl.steps.StoreSnapshotsStep.execute(StoreSnapshotsStep.java:23)
    18:24:45 at org.gradle.internal.execution.impl.steps.SkipUpToDateStep.executeBecause(SkipUpToDateStep.java:96)
    18:24:45 at org.gradle.internal.execution.impl.steps.SkipUpToDateStep.lambda$execute$1(SkipUpToDateStep.java:91)
    18:24:45 at java.util.Optional.orElseGet(Optional.java:267)
    18:24:45 at org.gradle.internal.execution.impl.steps.SkipUpToDateStep.execute(SkipUpToDateStep.java:91)
    18:24:45 at org.gradle.internal.execution.impl.steps.SkipUpToDateStep.execute(SkipUpToDateStep.java:36)
    18:24:45 at org.gradle.internal.execution.impl.DefaultWorkExecutor.execute(DefaultWorkExecutor.java:34)
    18:24:45 at org.gradle.api.internal.tasks.execution.ExecuteActionsTaskExecuter.execute(ExecuteActionsTaskExecuter.java:91)
    18:24:45 at org.gradle.api.internal.tasks.execution.ResolveTaskOutputCachingStateExecuter.execute(ResolveTaskOutputCachingStateExecuter.java:91)
    18:24:45 at org.gradle.api.internal.tasks.execution.ValidatingTaskExecuter.execute(ValidatingTaskExecuter.java:57)
    18:24:45 at org.gradle.api.internal.tasks.execution.SkipEmptySourceFilesTaskExecuter.execute(SkipEmptySourceFilesTaskExecuter.java:119)
    18:24:45 at org.gradle.api.internal.tasks.execution.ResolvePreviousStateExecuter.execute(ResolvePreviousStateExecuter.java:43)
    18:24:45 at org.gradle.api.internal.tasks.execution.CleanupStaleOutputsExecuter.execute(CleanupStaleOutputsExecuter.java:93)
    18:24:45 at org.gradle.api.internal.tasks.execution.FinalizePropertiesTaskExecuter.execute(FinalizePropertiesTaskExecuter.java:45)
    18:24:45 at org.gradle.api.internal.tasks.execution.ResolveTaskArtifactStateTaskExecuter.execute(ResolveTaskArtifactStateTaskExecuter.java:94)
    18:24:45 at org.gradle.api.internal.tasks.execution.SkipTaskWithNoActionsExecuter.execute(SkipTaskWithNoActionsExecuter.java:56)
    18:24:45 at org.gradle.api.internal.tasks.execution.SkipOnlyIfTaskExecuter.execute(SkipOnlyIfTaskExecuter.java:55)
    18:24:45 at org.gradle.api.internal.tasks.execution.CatchExceptionTaskExecuter.execute(CatchExceptionTaskExecuter.java:36)
    18:24:45 at org.gradle.api.internal.tasks.execution.EventFiringTaskExecuter$1.executeTask(EventFiringTaskExecuter.java:67)
    18:24:45 at org.gradle.api.internal.tasks.execution.EventFiringTaskExecuter$1.call(EventFiringTaskExecuter.java:52)
    18:24:45 at org.gradle.api.internal.tasks.execution.EventFiringTaskExecuter$1.call(EventFiringTaskExecuter.java:49)
    18:24:45 at org.gradle.internal.operations.DefaultBuildOperationExecutor$CallableBuildOperationWorker.execute(DefaultBuildOperationExecutor.java:315)
    18:24:45 at org.gradle.internal.operations.DefaultBuildOperationExecutor$CallableBuildOperationWorker.execute(DefaultBuildOperationExecutor.java:305)
    18:24:45 at org.gradle.internal.operations.DefaultBuildOperationExecutor.execute(DefaultBuildOperationExecutor.java:175)
    18:24:45 at org.gradle.internal.operations.DefaultBuildOperationExecutor.call(DefaultBuildOperationExecutor.java:101)
    18:24:45 at org.gradle.internal.operations.DelegatingBuildOperationExecutor.call(DelegatingBuildOperationExecutor.java:36)
    18:24:45 at org.gradle.api.internal.tasks.execution.EventFiringTaskExecuter.execute(EventFiringTaskExecuter.java:49)
    18:24:45 at org.gradle.execution.plan.LocalTaskNodeExecutor.execute(LocalTaskNodeExecutor.java:43)
    18:24:45 at org.gradle.execution.taskgraph.DefaultTaskExecutionGraph$InvokeNodeExecutorsAction.execute(DefaultTaskExecutionGraph.java:355)
    18:24:45 at org.gradle.execution.taskgraph.DefaultTaskExecutionGraph$InvokeNodeExecutorsAction.execute(DefaultTaskExecutionGraph.java:343)
    18:24:45 at org.gradle.execution.taskgraph.DefaultTaskExecutionGraph$BuildOperationAwareExecutionAction.execute(DefaultTaskExecutionGraph.java:336)
    18:24:45 at org.gradle.execution.taskgraph.DefaultTaskExecutionGraph$BuildOperationAwareExecutionAction.execute(DefaultTaskExecutionGraph.java:322)
    18:24:45 at org.gradle.execution.plan.DefaultPlanExecutor$ExecutorWorker$1.execute(DefaultPlanExecutor.java:134)
    18:24:45 at org.gradle.execution.plan.DefaultPlanExecutor$ExecutorWorker$1.execute(DefaultPlanExecutor.java:129)
    18:24:45 at org.gradle.execution.plan.DefaultPlanExecutor$ExecutorWorker.execute(DefaultPlanExecutor.java:202)
    18:24:45 at org.gradle.execution.plan.DefaultPlanExecutor$ExecutorWorker.executeNextNode(DefaultPlanExecutor.java:193)
    18:24:45 at org.gradle.execution.plan.DefaultPlanExecutor$ExecutorWorker.run(DefaultPlanExecutor.java:129)
    18:24:45 at org.gradle.execution.plan.DefaultPlanExecutor.process(DefaultPlanExecutor.java:74)
    18:24:45 at org.gradle.execution.taskgraph.DefaultTaskExecutionGraph.executeWithServices(DefaultTaskExecutionGraph.java:178)
    18:24:45 at org.gradle.execution.taskgraph.DefaultTaskExecutionGraph.execute(DefaultTaskExecutionGraph.java:154)
    18:24:45 at org.gradle.execution.SelectedTaskExecutionAction.execute(SelectedTaskExecutionAction.java:41)
    18:24:45 at org.gradle.execution.DefaultBuildExecuter.execute(DefaultBuildExecuter.java:40)
    18:24:45 at org.gradle.execution.DefaultBuildExecuter.access$000(DefaultBuildExecuter.java:24)
    18:24:45 at org.gradle.execution.DefaultBuildExecuter$1.proceed(DefaultBuildExecuter.java:46)
    18:24:45 at org.gradle.execution.DryRunBuildExecutionAction.execute(DryRunBuildExecutionAction.java:49)
    18:24:45 at org.gradle.execution.DefaultBuildExecuter.execute(DefaultBuildExecuter.java:40)
    18:24:45 at org.gradle.execution.DefaultBuildExecuter.execute(DefaultBuildExecuter.java:33)
    18:24:45 at org.gradle.initialization.DefaultGradleLauncher$ExecuteTasks.run(DefaultGradleLauncher.java:383)
    18:24:45 at org.gradle.internal.operations.DefaultBuildOperationExecutor$RunnableBuildOperationWorker.execute(DefaultBuildOperationExecutor.java:301)
    18:24:45 at org.gradle.internal.operations.DefaultBuildOperationExecutor$RunnableBuildOperationWorker.execute(DefaultBuildOperationExecutor.java:293)
    18:24:45 at org.gradle.internal.operations.DefaultBuildOperationExecutor.execute(DefaultBuildOperationExecutor.java:175)
    18:24:45 at org.gradle.internal.operations.DefaultBuildOperationExecutor.run(DefaultBuildOperationExecutor.java:91)
    18:24:45 at org.gradle.internal.operations.DelegatingBuildOperationExecutor.run(DelegatingBuildOperationExecutor.java:31)
    18:24:45 at org.gradle.initialization.DefaultGradleLauncher.runTasks(DefaultGradleLauncher.java:247)
    18:24:45 at org.gradle.initialization.DefaultGradleLauncher.doBuildStages(DefaultGradleLauncher.java:159)
    18:24:45 at org.gradle.initialization.DefaultGradleLauncher.executeTasks(DefaultGradleLauncher.java:134)
    18:24:45 at org.gradle.internal.invocation.GradleBuildController$1.execute(GradleBuildController.java:58)
    18:24:45 at org.gradle.internal.invocation.GradleBuildController$1.execute(GradleBuildController.java:55)
    18:24:45 at org.gradle.internal.invocation.GradleBuildController$3.create(GradleBuildController.java:82)
    18:24:45 at org.gradle.internal.invocation.GradleBuildController$3.create(GradleBuildController.java:75)
    18:24:45 at org.gradle.internal.work.DefaultWorkerLeaseService.withLocks(DefaultWorkerLeaseService.java:183)
    18:24:45 at org.gradle.internal.work.StopShieldingWorkerLeaseService.withLocks(StopShieldingWorkerLeaseService.java:40)
    18:24:45 at org.gradle.internal.invocation.GradleBuildController.doBuild(GradleBuildController.java:75)
    18:24:45 at org.gradle.internal.invocation.GradleBuildController.run(GradleBuildController.java:55)
    18:24:45 at org.gradle.tooling.internal.provider.ExecuteBuildActionRunner.run(ExecuteBuildActionRunner.java:31)
    18:24:45 at org.gradle.launcher.exec.ChainingBuildActionRunner.run(ChainingBuildActionRunner.java:35)
    18:24:45 at org.gradle.launcher.exec.BuildOutcomeReportingBuildActionRunner.run(BuildOutcomeReportingBuildActionRunner.java:58)
    18:24:45 at org.gradle.tooling.internal.provider.ValidatingBuildActionRunner.run(ValidatingBuildActionRunner.java:32)
    18:24:45 at org.gradle.launcher.exec.BuildCompletionNotifyingBuildActionRunner.run(BuildCompletionNotifyingBuildActionRunner.java:39)
    18:24:45 at org.gradle.launcher.exec.RunAsBuildOperationBuildActionRunner$3.call(RunAsBuildOperationBuildActionRunner.java:49)
    18:24:45 at org.gradle.launcher.exec.RunAsBuildOperationBuildActionRunner$3.call(RunAsBuildOperationBuildActionRunner.java:44)
    18:24:45 at org.gradle.internal.operations.DefaultBuildOperationExecutor$CallableBuildOperationWorker.execute(DefaultBuildOperationExecutor.java:315)
    18:24:45 at org.gradle.internal.operations.DefaultBuildOperationExecutor$CallableBuildOperationWorker.execute(DefaultBuildOperationExecutor.java:305)
    18:24:45 at org.gradle.internal.operations.DefaultBuildOperationExecutor.execute(DefaultBuildOperationExecutor.java:175)
    18:24:45 at org.gradle.internal.operations.DefaultBuildOperationExecutor.call(DefaultBuildOperationExecutor.java:101)
    18:24:45 at org.gradle.internal.operations.DelegatingBuildOperationExecutor.call(DelegatingBuildOperationExecutor.java:36)
    18:24:45 at org.gradle.launcher.exec.RunAsBuildOperationBuildActionRunner.run(RunAsBuildOperationBuildActionRunner.java:44)
    18:24:45 at org.gradle.launcher.exec.InProcessBuildActionExecuter$1.transform(InProcessBuildActionExecuter.java:49)
    18:24:45 at org.gradle.launcher.exec.InProcessBuildActionExecuter$1.transform(InProcessBuildActionExecuter.java:46)
    18:24:45 at org.gradle.composite.internal.DefaultRootBuildState.run(DefaultRootBuildState.java:78)
    18:24:45 at org.gradle.launcher.exec.InProcessBuildActionExecuter.execute(InProcessBuildActionExecuter.java:46)
    18:24:45 at org.gradle.launcher.exec.InProcessBuildActionExecuter.execute(InProcessBuildActionExecuter.java:31)
    18:24:45 at org.gradle.launcher.exec.BuildTreeScopeBuildActionExecuter.execute(BuildTreeScopeBuildActionExecuter.java:42)
    18:24:45 at org.gradle.launcher.exec.BuildTreeScopeBuildActionExecuter.execute(BuildTreeScopeBuildActionExecuter.java:28)
    18:24:45 at org.gradle.tooling.internal.provider.ContinuousBuildActionExecuter.execute(ContinuousBuildActionExecuter.java:78)
    18:24:45 at org.gradle.tooling.internal.provider.ContinuousBuildActionExecuter.execute(ContinuousBuildActionExecuter.java:52)
    18:24:45 at org.gradle.tooling.internal.provider.SubscribableBuildActionExecuter.execute(SubscribableBuildActionExecuter.java:59)
    18:24:45 at org.gradle.tooling.internal.provider.SubscribableBuildActionExecuter.execute(SubscribableBuildActionExecuter.java:36)
    18:24:45 at org.gradle.tooling.internal.provider.SessionScopeBuildActionExecuter.execute(SessionScopeBuildActionExecuter.java:68)
    18:24:45 at org.gradle.tooling.internal.provider.SessionScopeBuildActionExecuter.execute(SessionScopeBuildActionExecuter.java:38)
    18:24:45 at org.gradle.tooling.internal.provider.GradleThreadBuildActionExecuter.execute(GradleThreadBuildActionExecuter.java:37)
    18:24:45 at org.gradle.tooling.internal.provider.GradleThreadBuildActionExecuter.execute(GradleThreadBuildActionExecuter.java:26)
    18:24:45 at org.gradle.tooling.internal.provider.ParallelismConfigurationBuildActionExecuter.execute(ParallelismConfigurationBuildActionExecuter.java:43)
    18:24:45 at org.gradle.tooling.internal.provider.ParallelismConfigurationBuildActionExecuter.execute(ParallelismConfigurationBuildActionExecuter.java:29)
    18:24:45 at org.gradle.tooling.internal.provider.StartParamsValidatingActionExecuter.execute(StartParamsValidatingActionExecuter.java:60)
    18:24:45 at org.gradle.tooling.internal.provider.StartParamsValidatingActionExecuter.execute(StartParamsValidatingActionExecuter.java:32)
    18:24:45 at org.gradle.tooling.internal.provider.SessionFailureReportingActionExecuter.execute(SessionFailureReportingActionExecuter.java:55)
    18:24:45 at org.gradle.tooling.internal.provider.SessionFailureReportingActionExecuter.execute(SessionFailureReportingActionExecuter.java:41)
    18:24:45 at org.gradle.tooling.internal.provider.SetupLoggingActionExecuter.execute(SetupLoggingActionExecuter.java:48)
    18:24:45 at org.gradle.tooling.internal.provider.SetupLoggingActionExecuter.execute(SetupLoggingActionExecuter.java:32)
    18:24:45 at org.gradle.launcher.daemon.server.exec.ExecuteBuild.doBuild(ExecuteBuild.java:67)
    18:24:45 at org.gradle.launcher.daemon.server.exec.BuildCommandOnly.execute(BuildCommandOnly.java:36)
    18:24:45 at org.gradle.launcher.daemon.server.api.DaemonCommandExecution.proceed(DaemonCommandExecution.java:104)
    18:24:45 at org.gradle.launcher.daemon.server.exec.WatchForDisconnection.execute(WatchForDisconnection.java:37)
    18:24:45 at org.gradle.launcher.daemon.server.api.DaemonCommandExecution.proceed(DaemonCommandExecution.java:104)
    18:24:45 at org.gradle.launcher.daemon.server.exec.ResetDeprecationLogger.execute(ResetDeprecationLogger.java:26)
    18:24:45 at org.gradle.launcher.daemon.server.api.DaemonCommandExecution.proceed(DaemonCommandExecution.java:104)
    18:24:45 at org.gradle.launcher.daemon.server.exec.RequestStopIfSingleUsedDaemon.execute(RequestStopIfSingleUsedDaemon.java:34)
    18:24:45 at org.gradle.launcher.daemon.server.api.DaemonCommandExecution.proceed(DaemonCommandExecution.java:104)
    18:24:45 at org.gradle.launcher.daemon.server.exec.ForwardClientInput$2.call(ForwardClientInput.java:74)
    18:24:45 at org.gradle.launcher.daemon.server.exec.ForwardClientInput$2.call(ForwardClientInput.java:72)
    18:24:45 at org.gradle.util.Swapper.swap(Swapper.java:38)
    18:24:45 at org.gradle.launcher.daemon.server.exec.ForwardClientInput.execute(ForwardClientInput.java:72)
    18:24:45 at org.gradle.launcher.daemon.server.api.DaemonCommandExecution.proceed(DaemonCommandExecution.java:104)
    18:24:45 at org.gradle.launcher.daemon.server.exec.LogAndCheckHealth.execute(LogAndCheckHealth.java:55)
    18:24:45 at org.gradle.launcher.daemon.server.api.DaemonCommandExecution.proceed(DaemonCommandExecution.java:104)
    18:24:45 at org.gradle.launcher.daemon.server.exec.LogToClient.doBuild(LogToClient.java:62)
    18:24:45 at org.gradle.launcher.daemon.server.exec.BuildCommandOnly.execute(BuildCommandOnly.java:36)
    18:24:45 at org.gradle.launcher.daemon.server.api.DaemonCommandExecution.proceed(DaemonCommandExecution.java:104)
    18:24:45 at org.gradle.launcher.daemon.server.exec.EstablishBuildEnvironment.doBuild(EstablishBuildEnvironment.java:81)
    18:24:45 at org.gradle.launcher.daemon.server.exec.BuildCommandOnly.execute(BuildCommandOnly.java:36)
    18:24:45 at org.gradle.launcher.daemon.server.api.DaemonCommandExecution.proceed(DaemonCommandExecution.java:104)
    18:24:45 at org.gradle.launcher.daemon.server.exec.StartBuildOrRespondWithBusy$1.run(StartBuildOrRespondWithBusy.java:50)
    18:24:45 at org.gradle.launcher.daemon.server.DaemonStateCoordinator$1.run(DaemonStateCoordinator.java:295)
    18:24:45 at org.gradle.internal.concurrent.ExecutorPolicy$CatchAndRecordFailures.onExecute(ExecutorPolicy.java:63)
    18:24:45 at org.gradle.internal.concurrent.ManagedExecutorImpl$1.run(ManagedExecutorImpl.java:46)
    18:24:45 at java.util.concurrent.ThreadPoolExecutor.runWorker(ThreadPoolExecutor.java:1149)
    18:24:45 at java.util.concurrent.ThreadPoolExecutor$Worker.run(ThreadPoolExecutor.java:624)
    18:24:45 at org.gradle.internal.concurrent.ThreadFactoryImpl$ManagedThreadRunnable.run(ThreadFactoryImpl.java:55)
    18:24:45 at java.lang.Thread.run(Thread.java:748)
    18:24:45
    18:24:45 FAILURE: Build failed with an exception.
    18:24:45
    18:24:45 * What went wrong:
    18:24:45 Execution failed for task ':launcher:compileReleaseJavaWithJavac'.
    18:24:45 > Compilation failed; see the compiler error output for details.


    This is a blocker for me. Is there any fix or workaround available for this?
     
  2. Voxel-Busters

    Voxel-Busters

    Joined:
    Feb 25, 2015
    Posts:
    1,994
    I think you may need to upgrade Gradle plugin version by upgrading unity.
    Can you try setting your JDK pointing to JDK 11 and let me know if it fixes it?
     
  3. xinatcg

    xinatcg

    Joined:
    Sep 30, 2020
    Posts:
    23
    anyone has built target 31 successfully with LTS Unity version, such as 2020.3.16f?
     
  4. Voxel-Busters

    Voxel-Busters

    Joined:
    Feb 25, 2015
    Posts:
    1,994
    This usually will go away when you use JDK 11.

    However, until unity supports JDK 11, you have an option mentioned by another user in a post.
    Upgrade your gradle version to 6.1+. We tried it for our customers and it worked fine.

    Steps to do
    1. Create a custom gradle template (base gradle template in new unity versions) - You can enabled this from player settings
    2. Set Android gralde plugin version from 3.4.3 to 4.0.1
    3. In external tools from preferences, point your gradle to 6.1.1 version (by downloading the gradle plugin from here)
    4. Try making a build.

    Update: Check here which gradle version you have from here(Version Compatibility).

    Cheers,
    VB Team
     
    Last edited: May 22, 2023
    PokerDawg, xjjon, jacobfnl and 4 others like this.
  5. xinatcg

    xinatcg

    Joined:
    Sep 30, 2020
    Posts:
    23
    still get same error :

    java.lang.AssertionError: annotationType(): unrecognized Attribute name MODULE (class com.sun.tools.javac.util.UnsharedNameTable$NameImpl)
     
  6. xinatcg

    xinatcg

    Joined:
    Sep 30, 2020
    Posts:
    23
    Finally, upgrade to 4.0.1 resolve the issue
     
    ZikW and Voxel-Busters like this.
  7. Voxel-Busters

    Voxel-Busters

    Joined:
    Feb 25, 2015
    Posts:
    1,994
    Updated! Right it should be 4.0.1
     
    ZikW and xinatcg like this.
  8. ImRizo

    ImRizo

    Joined:
    Dec 15, 2020
    Posts:
    1
    it works!!! thanks!!
     
    Voxel-Busters likes this.
  9. SonuIxia

    SonuIxia

    Joined:
    Sep 3, 2018
    Posts:
    16
    Hi i am using unity 2019.4.0f1 LTS version and trying to make a build for Android 12 (Build Target 31).
    any one is able to make the gradle build for the same.
    I followed the above procedure mentioned but was not able to resolve the issue.
    Procedure that i Have followed.
    1.Checked Custom base gradle template.
    2.Change class path form 3.4.0 To 4.0.1
    and tried to make the build, I am getting following error.
    CommandInvokationFailure: Gradle build failed.
    C:/Program Files/Unity/Hub/Editor/2019.4.0f1/Editor/Data/PlaybackEngines/AndroidPlayer\OpenJDK\bin\java.exe -classpath "C:\Users\sonu.sharma\Documents\gradle-6.1.1-all\gradle-6.1.1\lib\gradle-launcher-6.1.1.jar" org.gradle.launcher.GradleMain "-Dorg.gradle.jvmargs=-Xmx4096m" "assembleRelease"

    stderr[
    Warning: Mapping new ns http://schemas.android.com/repository/android/common/02 to old ns http://schemas.android.com/repository/android/common/01
    Warning: Mapping new ns http://schemas.android.com/repository/android/generic/02 to old ns http://schemas.android.com/repository/android/generic/01
    Warning: Mapping new ns http://schemas.android.com/sdk/android/repo/addon2/02 to old ns http://schemas.android.com/sdk/android/repo/addon2/01
    Warning: Mapping new ns http://schemas.android.com/sdk/android/repo/addon2/03 to old ns http://schemas.android.com/sdk/android/repo/addon2/01
    Warning: Mapping new ns http://schemas.android.com/sdk/android/repo/repository2/02 to old ns http://schemas.android.com/sdk/android/repo/repository2/01
    Warning: Mapping new ns http://schemas.android.com/sdk/android/repo/repository2/03 to old ns http://schemas.android.com/sdk/android/repo/repository2/01
    Warning: Mapping new ns http://schemas.android.com/sdk/android/repo/sys-img2/03 to old ns http://schemas.android.com/sdk/android/repo/sys-img2/01
    Warning: Mapping new ns http://schemas.android.com/sdk/android/repo/sys-img2/02 to old ns http://schemas.android.com/sdk/android/repo/sys-img2/01

    FAILURE: Build completed with 2 failures.

    1: Task failed with an exception.
    -----------
    * What went wrong:
    Execution failed for task ':launcher:processReleaseResources'.
    > Could not resolve all files for configuration ':launcher:releaseRuntimeClasspath'.
    > Failed to transform ARPresto-.aar :)ARPresto:) to match attributes {artifactType=android-compiled-dependencies-resources, org.gradle.status=integration}.
    > Execution failed for AarResourcesCompilerTransform: C:\Users\sonu.sharma\.gradle\caches\transforms-2\files-2.1\dc43409d2c1bafea84a2ab06f0406d25\ARPresto.
    > C:\Users\sonu.sharma\.gradle\caches\transforms-2\files-2.1\dc43409d2c1bafea84a2ab06f0406d25\ARPresto\AndroidManifest.xml
    > Failed to transform UnityARCore-.aar :)UnityARCore:) to match attributes {artifactType=android-compiled-dependencies-resources, org.gradle.status=integration}.
    > Execution failed for AarResourcesCompilerTransform: C:\Users\sonu.sharma\.gradle\caches\transforms-2\files-2.1\7d30c5555ae8275aea76844db1bd7f0f\UnityARCore.
    > C:\Users\sonu.sharma\.gradle\caches\transforms-2\files-2.1\7d30c5555ae8275aea76844db1bd7f0f\UnityARCore\AndroidManifest.xml

    * Try:
    Run with --stacktrace option to get the stack trace. Run with --info or --debug option to get more log output. Run with --scan to get full insights.
    ==============================================================================

    2: Task failed with an exception.
    -----------
    * What went wrong:
    Execution failed for task ':unityLibrary:compileReleaseJavaWithJavac'.
    > Could not resolve all files for configuration ':unityLibrary:releaseCompileClasspath'.
    > Failed to transform ARPresto-.aar :)ARPresto:) to match attributes {artifactType=android-classes-jar, org.gradle.status=integration, org.gradle.usage=java-api}.
    > Execution failed for AarToClassTransform: C:\sonu work\CTE\CTE-AR\UnityProject\CTEAR\Temp\gradleOut\unityLibrary\libs\ARPresto.aar.
    > entry
    > Failed to transform UnityARCore-.aar :)UnityARCore:) to match attributes {artifactType=android-classes-jar, org.gradle.status=integration, org.gradle.usage=java-api}.
    > Execution failed for AarToClassTransform: C:\sonu work\CTE\CTE-AR\UnityProject\CTEAR\Temp\gradleOut\unityLibrary\libs\UnityARCore.aar.
    > entry

    * Try:
    Run with --stacktrace option to get the stack trace. Run with --info or --debug option to get more log output. Run with --scan to get full insights.
    ==============================================================================

    * Get more help at https://help.gradle.org

    BUILD FAILED in 1m 1s
    ]
    stdout[

    > Configure project :launcher
    WARNING: DSL element 'useProguard' is obsolete.
    It will be removed in version 5.0 of the Android Gradle plugin.
    Use 'android.enableR8' in gradle.properties to switch between R8 and Proguard.
    WARNING: DSL element 'useProguard' is obsolete.
    It will be removed in version 5.0 of the Android Gradle plugin.
    Use 'android.enableR8' in gradle.properties to switch between R8 and Proguard.

    > Task :unityLibrary:preBuild UP-TO-DATE
    > Task :launcher:preBuild UP-TO-DATE
    > Task :unityLibrary:preReleaseBuild UP-TO-DATE
    > Task :launcher:preReleaseBuild UP-TO-DATE
    > Task :unityLibrary:compileReleaseAidl NO-SOURCE
    > Task :unityLibrary:packageReleaseRenderscript NO-SOURCE
    > Task :unityLibrary:compileReleaseRenderscript NO-SOURCE
    > Task :unityLibrary:generateReleaseResValues
    > Task :unityLibrary:generateReleaseResources
    > Task :launcher:generateReleaseBuildConfig
    > Task :launcher:compileReleaseAidl NO-SOURCE
    > Task :launcher:compileReleaseRenderscript NO-SOURCE
    > Task :launcher:generateReleaseResValues
    > Task :launcher:generateReleaseResources
    > Task :launcher:createReleaseCompatibleScreenManifests
    > Task :launcher:extractDeepLinksRelease
    > Task :launcher:prepareLintJar
    > Task :launcher:javaPreCompileRelease
    > Task :unityLibrary:packageReleaseResources
    > Task :unityLibrary:extractDeepLinksRelease
    > Task :launcher:checkReleaseDuplicateClasses
    > Task :unityLibrary:processReleaseManifest
    > Task :unityLibrary:generateReleaseBuildConfig
    > Task :unityLibrary:compileReleaseLibraryResources
    > Task :unityLibrary:mergeReleaseShaders
    > Task :unityLibrary:compileReleaseShaders NO-SOURCE
    > Task :unityLibrary:generateReleaseAssets UP-TO-DATE
    > Task :unityLibrary:packageReleaseAssets
    > Task :unityLibrary:processReleaseJavaRes NO-SOURCE
    > Task :unityLibrary:bundleLibResRelease NO-SOURCE
    > Task :unityLibrary:mergeReleaseJniLibFolders
    > Task :launcher:processReleaseManifest
    > Task :unityLibrary:parseReleaseLocalResources
    > Task :launcher:mergeReleaseShaders
    > Task :launcher:compileReleaseShaders NO-SOURCE
    > Task :launcher:generateReleaseAssets UP-TO-DATE
    > Task :launcher:mergeReleaseAssets
    > Task :launcher:processReleaseJavaRes NO-SOURCE
    > Task :launcher:collectReleaseDependencies
    > Task :unityLibrary:prepareLintJarForPublish
    > Task :unityLibrary:javaPreCompileRelease
    > Task :unityLibrary:mergeReleaseNativeLibs
    > Task :launcher:sdkReleaseDependencyData
    > Task :launcher:mergeReleaseJniLibFolders
    > Task :launcher:validateSigningRelease
    > Task :launcher:mergeReleaseResources
    > Task :launcher:mergeReleaseJavaResource
    > Task :unityLibrary:stripReleaseDebugSymbols
    > Task :unityLibrary:copyReleaseJniLibsProjectOnly
    > Task :unityLibrary:generateReleaseRFile
    > Task :launcher:processReleaseResources FAILED
    > Task :unityLibrary:compileReleaseJavaWithJavac FAILED
    > Task :launcher:desugarReleaseFileDependencies
    > Task :launcher:mergeReleaseNativeLibs
    36 actionable tasks: 36 executed
    ]
    exit code: 1
    UnityEditor.Android.Command.WaitForProgramToRun (UnityEditor.Utils.Program p, UnityEditor.Android.Command+WaitingForProcessToExit waitingForProcessToExit, System.String errorMsg) (at <3167064085404657b0d6c498207da025>:0)
    UnityEditor.Android.Command.Run (System.Diagnostics.ProcessStartInfo psi, UnityEditor.Android.Command+WaitingForProcessToExit waitingForProcessToExit, System.String errorMsg) (at <3167064085404657b0d6c498207da025>:0)
    UnityEditor.Android.Command.Run (System.String command, System.String args, System.String workingdir, UnityEditor.Android.Command+WaitingForProcessToExit waitingForProcessToExit, System.String errorMsg) (at <3167064085404657b0d6c498207da025>:0)
    UnityEditor.Android.AndroidJavaTools.RunJava (System.String args, System.String workingdir, System.Action`1[T] progress, System.String error) (at <3167064085404657b0d6c498207da025>:0)
    UnityEditor.Android.GradleWrapper.Run (UnityEditor.Android.AndroidJavaTools javaTools, System.String workingdir, System.String task, System.Action`1[T] progress) (at <3167064085404657b0d6c498207da025>:0)
    Rethrow as GradleInvokationException: Gradle build failed
    UnityEditor.Android.GradleWrapper.Run (UnityEditor.Android.AndroidJavaTools javaTools, System.String workingdir, System.String task, System.Action`1[T] progress) (at <3167064085404657b0d6c498207da025>:0)
    UnityEditor.Android.PostProcessor.Tasks.BuildGradleProject.Execute (UnityEditor.Android.PostProcessor.PostProcessorContext context) (at <3167064085404657b0d6c498207da025>:0)
    UnityEditor.Android.PostProcessor.PostProcessRunner.RunAllTasks (UnityEditor.Android.PostProcessor.PostProcessorContext context) (at <3167064085404657b0d6c498207da025>:0)
    Rethrow as BuildFailedException: Exception of type 'UnityEditor.Build.BuildFailedException' was thrown.
    UnityEditor.Android.PostProcessor.CancelPostProcess.AbortBuild (System.String title, System.String message, System.Exception ex) (at <3167064085404657b0d6c498207da025>:0)
    UnityEditor.Android.PostProcessor.PostProcessRunner.RunAllTasks (UnityEditor.Android.PostProcessor.PostProcessorContext context) (at <3167064085404657b0d6c498207da025>:0)
    UnityEditor.Android.PostProcessAndroidPlayer.PostProcess (UnityEditor.BuildTarget target, System.String stagingAreaData, System.String stagingArea, System.String playerPackage, System.String installPath, System.String companyName, System.String productName, UnityEditor.BuildOptions options, UnityEditor.RuntimeClassRegistry usedClassRegistry, UnityEditor.Build.Reporting.BuildReport report) (at <3167064085404657b0d6c498207da025>:0)
    UnityEditor.Android.AndroidBuildPostprocessor.PostProcess (UnityEditor.Modules.BuildPostProcessArgs args, UnityEditor.BuildProperties& outProperties) (at <3167064085404657b0d6c498207da025>:0)
    UnityEditor.PostprocessBuildPlayer.Postprocess (UnityEditor.BuildTargetGroup targetGroup, UnityEditor.BuildTarget target, System.String installPath, System.String companyName, System.String productName, System.Int32 width, System.Int32 height, UnityEditor.BuildOptions options, UnityEditor.RuntimeClassRegistry usedClassRegistry, UnityEditor.Build.Reporting.BuildReport report) (at <af78ad00a40d4f61b82afc6cafb0a416>:0)
    UnityEngine.GUIUtility:processEvent(Int32, IntPtr)
     
  10. SonuIxia

    SonuIxia

    Joined:
    Sep 3, 2018
    Posts:
    16

    Hi i am using unity 2019.4.0f1 LTS version and trying to make a build for Android 12 (Build Target 31).
    any one is able to make the gradle build for the same.
    I followed the above procedure mentioned but was not able to resolve the issue.
    Procedure that i Have followed.
    1.Checked Custom base gradle template.
    2.Change class path form 3.4.0 To 4.0.1
    and tried to make the build, I am getting following error.
    CommandInvokationFailure: Gradle build failed.
    C:/Program Files/Unity/Hub/Editor/2019.4.0f1/Editor/Data/PlaybackEngines/AndroidPlayer\OpenJDK\bin\java.exe -classpath "C:\Users\sonu.sharma\Documents\gradle-6.1.1-all\gradle-6.1.1\lib\gradle-launcher-6.1.1.jar" org.gradle.launcher.GradleMain "-Dorg.gradle.jvmargs=-Xmx4096m" "assembleRelease"

    stderr[
    Warning: Mapping new ns http://schemas.android.com/repository/android/common/02 to old ns http://schemas.android.com/repository/android/common/01
    Warning: Mapping new ns http://schemas.android.com/repository/android/generic/02 to old ns http://schemas.android.com/repository/android/generic/01
    Warning: Mapping new ns http://schemas.android.com/sdk/android/repo/addon2/02 to old ns http://schemas.android.com/sdk/android/repo/addon2/01
    Warning: Mapping new ns http://schemas.android.com/sdk/android/repo/addon2/03 to old ns http://schemas.android.com/sdk/android/repo/addon2/01
    Warning: Mapping new ns http://schemas.android.com/sdk/android/repo/repository2/02 to old ns http://schemas.android.com/sdk/android/repo/repository2/01
    Warning: Mapping new ns http://schemas.android.com/sdk/android/repo/repository2/03 to old ns http://schemas.android.com/sdk/android/repo/repository2/01
    Warning: Mapping new ns http://schemas.android.com/sdk/android/repo/sys-img2/03 to old ns http://schemas.android.com/sdk/android/repo/sys-img2/01
    Warning: Mapping new ns http://schemas.android.com/sdk/android/repo/sys-img2/02 to old ns http://schemas.android.com/sdk/android/repo/sys-img2/01

    FAILURE: Build completed with 2 failures.

    1: Task failed with an exception.
    -----------
    * What went wrong:
    Execution failed for task ':launcher:processReleaseResources'.
    > Could not resolve all files for configuration ':launcher:releaseRuntimeClasspath'.
    > Failed to transform ARPresto-.aar :)ARPresto:) to match attributes {artifactType=android-compiled-dependencies-resources, org.gradle.status=integration}.
    > Execution failed for AarResourcesCompilerTransform: C:\Users\sonu.sharma\.gradle\caches\transforms-2\files-2.1\dc43409d2c1bafea84a2ab06f0406d25\ARPresto.
    > C:\Users\sonu.sharma\.gradle\caches\transforms-2\files-2.1\dc43409d2c1bafea84a2ab06f0406d25\ARPresto\AndroidManifest.xml
    > Failed to transform UnityARCore-.aar :)UnityARCore:) to match attributes {artifactType=android-compiled-dependencies-resources, org.gradle.status=integration}.
    > Execution failed for AarResourcesCompilerTransform: C:\Users\sonu.sharma\.gradle\caches\transforms-2\files-2.1\7d30c5555ae8275aea76844db1bd7f0f\UnityARCore.
    > C:\Users\sonu.sharma\.gradle\caches\transforms-2\files-2.1\7d30c5555ae8275aea76844db1bd7f0f\UnityARCore\AndroidManifest.xml

    * Try:
    Run with --stacktrace option to get the stack trace. Run with --info or --debug option to get more log output. Run with --scan to get full insights.
    ==============================================================================

    2: Task failed with an exception.
    -----------
    * What went wrong:
    Execution failed for task ':unityLibrary:compileReleaseJavaWithJavac'.
    > Could not resolve all files for configuration ':unityLibrary:releaseCompileClasspath'.
    > Failed to transform ARPresto-.aar :)ARPresto:) to match attributes {artifactType=android-classes-jar, org.gradle.status=integration, org.gradle.usage=java-api}.
    > Execution failed for AarToClassTransform: C:\sonu work\CTE\CTE-AR\UnityProject\CTEAR\Temp\gradleOut\unityLibrary\libs\ARPresto.aar.
    > entry
    > Failed to transform UnityARCore-.aar :)UnityARCore:) to match attributes {artifactType=android-classes-jar, org.gradle.status=integration, org.gradle.usage=java-api}.
    > Execution failed for AarToClassTransform: C:\sonu work\CTE\CTE-AR\UnityProject\CTEAR\Temp\gradleOut\unityLibrary\libs\UnityARCore.aar.
    > entry

    * Try:
    Run with --stacktrace option to get the stack trace. Run with --info or --debug option to get more log output. Run with --scan to get full insights.
    ==============================================================================

    * Get more help at https://help.gradle.org

    BUILD FAILED in 1m 1s
    ]
    stdout[

    > Configure project :launcher
    WARNING: DSL element 'useProguard' is obsolete.
    It will be removed in version 5.0 of the Android Gradle plugin.
    Use 'android.enableR8' in gradle.properties to switch between R8 and Proguard.
    WARNING: DSL element 'useProguard' is obsolete.
    It will be removed in version 5.0 of the Android Gradle plugin.
    Use 'android.enableR8' in gradle.properties to switch between R8 and Proguard.

    > Task :unityLibrary:preBuild UP-TO-DATE
    > Task :launcher:preBuild UP-TO-DATE
    > Task :unityLibrary:preReleaseBuild UP-TO-DATE
    > Task :launcher:preReleaseBuild UP-TO-DATE
    > Task :unityLibrary:compileReleaseAidl NO-SOURCE
    > Task :unityLibrary:packageReleaseRenderscript NO-SOURCE
    > Task :unityLibrary:compileReleaseRenderscript NO-SOURCE
    > Task :unityLibrary:generateReleaseResValues
    > Task :unityLibrary:generateReleaseResources
    > Task :launcher:generateReleaseBuildConfig
    > Task :launcher:compileReleaseAidl NO-SOURCE
    > Task :launcher:compileReleaseRenderscript NO-SOURCE
    > Task :launcher:generateReleaseResValues
    > Task :launcher:generateReleaseResources
    > Task :launcher:createReleaseCompatibleScreenManifests
    > Task :launcher:extractDeepLinksRelease
    > Task :launcher:prepareLintJar
    > Task :launcher:javaPreCompileRelease
    > Task :unityLibrary:packageReleaseResources
    > Task :unityLibrary:extractDeepLinksRelease
    > Task :launcher:checkReleaseDuplicateClasses
    > Task :unityLibrary:processReleaseManifest
    > Task :unityLibrary:generateReleaseBuildConfig
    > Task :unityLibrary:compileReleaseLibraryResources
    > Task :unityLibrary:mergeReleaseShaders
    > Task :unityLibrary:compileReleaseShaders NO-SOURCE
    > Task :unityLibrary:generateReleaseAssets UP-TO-DATE
    > Task :unityLibrary:packageReleaseAssets
    > Task :unityLibrary:processReleaseJavaRes NO-SOURCE
    > Task :unityLibrary:bundleLibResRelease NO-SOURCE
    > Task :unityLibrary:mergeReleaseJniLibFolders
    > Task :launcher:processReleaseManifest
    > Task :unityLibrary:parseReleaseLocalResources
    > Task :launcher:mergeReleaseShaders
    > Task :launcher:compileReleaseShaders NO-SOURCE
    > Task :launcher:generateReleaseAssets UP-TO-DATE
    > Task :launcher:mergeReleaseAssets
    > Task :launcher:processReleaseJavaRes NO-SOURCE
    > Task :launcher:collectReleaseDependencies
    > Task :unityLibrary:prepareLintJarForPublish
    > Task :unityLibrary:javaPreCompileRelease
    > Task :unityLibrary:mergeReleaseNativeLibs
    > Task :launcher:sdkReleaseDependencyData
    > Task :launcher:mergeReleaseJniLibFolders
    > Task :launcher:validateSigningRelease
    > Task :launcher:mergeReleaseResources
    > Task :launcher:mergeReleaseJavaResource
    > Task :unityLibrary:stripReleaseDebugSymbols
    > Task :unityLibrary:copyReleaseJniLibsProjectOnly
    > Task :unityLibrary:generateReleaseRFile
    > Task :launcher:processReleaseResources FAILED
    > Task :unityLibrary:compileReleaseJavaWithJavac FAILED
    > Task :launcher:desugarReleaseFileDependencies
    > Task :launcher:mergeReleaseNativeLibs
    36 actionable tasks: 36 executed
    ]
    exit code: 1
    UnityEditor.Android.Command.WaitForProgramToRun (UnityEditor.Utils.Program p, UnityEditor.Android.Command+WaitingForProcessToExit waitingForProcessToExit, System.String errorMsg) (at <3167064085404657b0d6c498207da025>:0)
    UnityEditor.Android.Command.Run (System.Diagnostics.ProcessStartInfo psi, UnityEditor.Android.Command+WaitingForProcessToExit waitingForProcessToExit, System.String errorMsg) (at <3167064085404657b0d6c498207da025>:0)
    UnityEditor.Android.Command.Run (System.String command, System.String args, System.String workingdir, UnityEditor.Android.Command+WaitingForProcessToExit waitingForProcessToExit, System.String errorMsg) (at <3167064085404657b0d6c498207da025>:0)
    UnityEditor.Android.AndroidJavaTools.RunJava (System.String args, System.String workingdir, System.Action`1[T] progress, System.String error) (at <3167064085404657b0d6c498207da025>:0)
    UnityEditor.Android.GradleWrapper.Run (UnityEditor.Android.AndroidJavaTools javaTools, System.String workingdir, System.String task, System.Action`1[T] progress) (at <3167064085404657b0d6c498207da025>:0)
    Rethrow as GradleInvokationException: Gradle build failed
    UnityEditor.Android.GradleWrapper.Run (UnityEditor.Android.AndroidJavaTools javaTools, System.String workingdir, System.String task, System.Action`1[T] progress) (at <3167064085404657b0d6c498207da025>:0)
    UnityEditor.Android.PostProcessor.Tasks.BuildGradleProject.Execute (UnityEditor.Android.PostProcessor.PostProcessorContext context) (at <3167064085404657b0d6c498207da025>:0)
    UnityEditor.Android.PostProcessor.PostProcessRunner.RunAllTasks (UnityEditor.Android.PostProcessor.PostProcessorContext context) (at <3167064085404657b0d6c498207da025>:0)
    Rethrow as BuildFailedException: Exception of type 'UnityEditor.Build.BuildFailedException' was thrown.
    UnityEditor.Android.PostProcessor.CancelPostProcess.AbortBuild (System.String title, System.String message, System.Exception ex) (at <3167064085404657b0d6c498207da025>:0)
    UnityEditor.Android.PostProcessor.PostProcessRunner.RunAllTasks (UnityEditor.Android.PostProcessor.PostProcessorContext context) (at <3167064085404657b0d6c498207da025>:0)
    UnityEditor.Android.PostProcessAndroidPlayer.PostProcess (UnityEditor.BuildTarget target, System.String stagingAreaData, System.String stagingArea, System.String playerPackage, System.String installPath, System.String companyName, System.String productName, UnityEditor.BuildOptions options, UnityEditor.RuntimeClassRegistry usedClassRegistry, UnityEditor.Build.Reporting.BuildReport report) (at <3167064085404657b0d6c498207da025>:0)
    UnityEditor.Android.AndroidBuildPostprocessor.PostProcess (UnityEditor.Modules.BuildPostProcessArgs args, UnityEditor.BuildProperties& outProperties) (at <3167064085404657b0d6c498207da025>:0)
    UnityEditor.PostprocessBuildPlayer.Postprocess (UnityEditor.BuildTargetGroup targetGroup, UnityEditor.BuildTarget target, System.String installPath, System.String companyName, System.String productName, System.Int32 width, System.Int32 height, UnityEditor.BuildOptions options, UnityEditor.RuntimeClassRegistry usedClassRegistry, UnityEditor.Build.Reporting.BuildReport report) (at <af78ad00a40d4f61b82afc6cafb0a416>:0)
    UnityEngine.GUIUtility:processEvent(Int32, IntPtr)
     
  11. xjjon

    xjjon

    Joined:
    Apr 15, 2016
    Posts:
    616
    Thanks this worked great. Here's the gradle installs: https://gradle.org/releases/

    Download 6.1.1 and it will work
     
    Voxel-Busters likes this.